Skip to content

feat: reduce block interval poc #643

feat: reduce block interval poc

feat: reduce block interval poc #643

GitHub Actions / JUnit Test Report failed Feb 28, 2025 in 0s

1003 tests run, 963 passed, 27 skipped, 13 failed.

Annotations

Check failure on line 1 in com/ethereum-optimism/optimism/op-node/rollup/derive

See this annotation in the file changed.

@github-actions github-actions / JUnit Test Report

com/ethereum-optimism/optimism/op-node/rollup/derive.TestBatchQueue/BatchQueueEager_SingularBatch

Failed
Raw output
=== RUN   TestBatchQueue/BatchQueueEager_SingularBatch
    batch_queue_test.go:292: 
        	Error Trace:	/home/runner/work/opbnb/opbnb/op-node/rollup/derive/batch_queue_test.go:292
        	            				/home/runner/work/opbnb/opbnb/op-node/rollup/derive/batch_queue_test.go:154
        	Error:      	Target error should be in err chain:
        	            	expected: ""
        	            	in chain: "not enough data"
        	Test:       	TestBatchQueue/BatchQueueEager_SingularBatch
--- FAIL: TestBatchQueue/BatchQueueEager_SingularBatch (0.00s)

Check failure on line 1 in com/ethereum-optimism/optimism/op-node/rollup/derive

See this annotation in the file changed.

@github-actions github-actions / JUnit Test Report

com/ethereum-optimism/optimism/op-node/rollup/derive.TestBatchQueue/BatchQueueEager_SpanBatch

Failed
Raw output
=== RUN   TestBatchQueue/BatchQueueEager_SpanBatch
    batch_queue_test.go:292: 
        	Error Trace:	/home/runner/work/opbnb/opbnb/op-node/rollup/derive/batch_queue_test.go:292
        	            				/home/runner/work/opbnb/opbnb/op-node/rollup/derive/batch_queue_test.go:161
        	Error:      	Target error should be in err chain:
        	            	expected: ""
        	            	in chain: "not enough data"
        	Test:       	TestBatchQueue/BatchQueueEager_SpanBatch
--- FAIL: TestBatchQueue/BatchQueueEager_SpanBatch (0.00s)

Check failure on line 1 in com/ethereum-optimism/optimism/op-node/rollup/derive

See this annotation in the file changed.

@github-actions github-actions / JUnit Test Report

com/ethereum-optimism/optimism/op-node/rollup/derive.TestBatchQueue/BatchQueueInvalidInternalAdvance_SpanBatch

Failed
Raw output
=== RUN   TestBatchQueue/BatchQueueInvalidInternalAdvance_SpanBatch
    batch_queue.go:235:         �[36mDEBUG�[0m[02-28|07:03:38.726] Adding batch                             �[36mbatch_type�[0m=SpanBatch �[36mbatch_timestamp�[0m=12 �[36mparent_check�[0m=0x0a00000000000000000000000000000000000000 �[36morigin_check�[0m=0x0a00000000000000000000000000000000000000 �[36mstart_epoch_number�[0m=0 �[36mend_epoch_number�[0m=0 �[36mblock_count�[0m=1
    batch_queue.go:248:         �[34mTRACE�[0m[02-28|07:03:38.726] Deriving the next batch                  �[34mepoch�[0m=0a0000..000001:0 �[34mparent�[0m=0a0000..000002:0 �[34moutOfData�[0m=false
    batch_queue.go:296:         �[32mINFO �[0m[02-28|07:03:38.726] Found next batch                         �[32mbatch_type�[0m=SpanBatch �[32mbatch_timestamp�[0m=12 �[32mparent_check�[0m=0x0a00000000000000000000000000000000000000 �[32morigin_check�[0m=0x0a00000000000000000000000000000000000000 �[32mstart_epoch_number�[0m=0 �[32mend_epoch_number�[0m=0 �[32mblock_count�[0m=1
    batch_queue.go:89:          �[36mDEBUG�[0m[02-28|07:03:38.726] pop next batch from the cached span batch
    batch_queue.go:235:         �[36mDEBUG�[0m[02-28|07:03:38.726] Adding batch                             �[36mbatch_type�[0m=SpanBatch �[36mbatch_timestamp�[0m=14 �[36mparent_check�[0m=0x0c00000000000000000000000000000000000000 �[36morigin_check�[0m=0x0a00000000000000000000000000000000000000 �[36mstart_epoch_number�[0m=0 �[36mend_epoch_number�[0m=0 �[36mblock_count�[0m=2
    batch_queue.go:248:         �[34mTRACE�[0m[02-28|07:03:38.726] Deriving the next batch                  �[34mepoch�[0m=0a0000..000001:0 �[34mparent�[0m=0c0000..000002:1 �[34moutOfData�[0m=false
    batch_queue.go:296:         �[32mINFO �[0m[02-28|07:03:38.726] Found next batch                         �[32mbatch_type�[0m=SpanBatch �[32mbatch_timestamp�[0m=14 �[32mparent_check�[0m=0x0c00000000000000000000000000000000000000 �[32morigin_check�[0m=0x0a00000000000000000000000000000000000000 �[32mstart_epoch_number�[0m=0 �[32mend_epoch_number�[0m=0 �[32mblock_count�[0m=2
    batch_queue.go:89:          �[36mDEBUG�[0m[02-28|07:03:38.726] pop next batch from the cached span batch
    batch_queue.go:107:         �[33mWARN �[0m[02-28|07:03:38.726] parent block does not match the next batch. dropped cached batches �[33mparent�[0m=0e0000..000002:2 �[33mnextBatchTime�[0m=16
    batches.go:200:             �[34mTRACE�[0m[02-28|07:03:38.726] received out-of-order batch for future processing after next batch �[34mbatch_type�[0m=SpanBatch �[34mbatch_timestamp�[0m=18 �[34mparent_check�[0m=0x1000000000000000000000000000000000000000 �[34morigin_check�[0m=0x0a00000000000000000000000000000000000000 �[34mstart_epoch_number�[0m=0 �[34mend_epoch_number�[0m=0 �[34mblock_count�[0m=3 �[34mnext_timestamp�[0m=16
    batch_queue.go:235:         �[36mDEBUG�[0m[02-28|07:03:38.726] Adding batch                             �[36mbatch_type�[0m=SpanBatch �[36mbatch_timestamp�[0m=18 �[36mparent_check�[0m=0x1000000000000000000000000000000000000000 �[36morigin_check�[0m=0x0a00000000000000000000000000000000000000 �[36mstart_epoch_number�[0m=0 �[36mend_epoch_number�[0m=0 �[36mblock_count�[0m=3
    batch_queue.go:248:         �[34mTRACE�[0m[02-28|07:03:38.727] Deriving the next batch                  �[34mepoch�[0m=0a0000..000001:0 �[34mparent�[0m=0e0000..000002:2 �[34moutOfData�[0m=false
    batches.go:200:             �[34mTRACE�[0m[02-28|07:03:38.727] received out-of-order batch for future processing after next batch �[34mbatch_index�[0m=0 �[34mbatch_type�[0m=SpanBatch �[34mbatch_timestamp�[0m=18 �[34mparent_check�[0m=0x1000000000000000000000000000000000000000 �[34morigin_check�[0m=0x0a00000000000000000000000000000000000000 �[34mstart_epoch_number�[0m=0 �[34mend_epoch_number�[0m=0 �[34mblock_count�[0m=3 �[34mnext_timestamp�[0m=16
    batch_queue.go:306:         �[34mTRACE�[0m[02-28|07:03:38.727] Potentially generating an empty batch    �[34mexpiryEpoch�[0m=2 �[34mforceEmptyBatches�[0m=false �[34mnextTimestamp�[0m=16 �[34mepoch_time�[0m=10 �[34mlen_l1_blocks�[0m=1 �[34mfirstOfEpoch�[0m=false
    batch_queue_test.go:369: 
        	Error Trace:	/home/runner/work/opbnb/opbnb/op-node/rollup/derive/batch_queue_test.go:369
        	            				/home/runner/work/opbnb/opbnb/op-node/rollup/derive/batch_queue_test.go:161
        	Error:      	Target error should be in err chain:
        	            	expected: ""
        	            	in chain: "not enough data"
        	Test:       	TestBatchQueue/BatchQueueInvalidInternalAdvance_SpanBatch
--- FAIL: TestBatchQueue/BatchQueueInvalidInternalAdvance_SpanBatch (0.00s)

Check failure on line 1 in com/ethereum-optimism/optimism/op-node/rollup/derive

See this annotation in the file changed.

@github-actions github-actions / JUnit Test Report

com/ethereum-optimism/optimism/op-node/rollup/derive.TestBatchQueue/BatchQueueAdvancedEpoch_SpanBatch

Failed
Raw output
=== RUN   TestBatchQueue/BatchQueueAdvancedEpoch_SpanBatch
    batch_queue_test.go:616: 
        	Error Trace:	/home/runner/work/opbnb/opbnb/op-node/rollup/derive/batch_queue_test.go:616
        	            				/home/runner/work/opbnb/opbnb/op-node/rollup/derive/batch_queue_test.go:161
        	Error:      	Target error should be in err chain:
        	            	expected: ""
        	            	in chain: "not enough data"
        	Test:       	TestBatchQueue/BatchQueueAdvancedEpoch_SpanBatch
--- FAIL: TestBatchQueue/BatchQueueAdvancedEpoch_SpanBatch (0.00s)

Check failure on line 1 in com/ethereum-optimism/optimism/op-node/rollup/derive

See this annotation in the file changed.

@github-actions github-actions / JUnit Test Report

com/ethereum-optimism/optimism/op-node/rollup/derive.TestBatchQueue/BatchQueueShuffle_SpanBatch

Failed
Raw output
=== RUN   TestBatchQueue/BatchQueueShuffle_SpanBatch
    batch_queue_test.go:715: 
        	Error Trace:	/home/runner/work/opbnb/opbnb/op-node/rollup/derive/batch_queue_test.go:715
        	            				/home/runner/work/opbnb/opbnb/op-node/rollup/derive/batch_queue_test.go:161
        	Error:      	Target error should be in err chain:
        	            	expected: ""
        	            	in chain: "EOF"
        	Test:       	TestBatchQueue/BatchQueueShuffle_SpanBatch
--- FAIL: TestBatchQueue/BatchQueueShuffle_SpanBatch (0.00s)

Check failure on line 1 in com/ethereum-optimism/optimism/op-node/rollup/derive

See this annotation in the file changed.

@github-actions github-actions / JUnit Test Report

com/ethereum-optimism/optimism/op-node/rollup/derive.TestBatchQueue

Failed
Raw output
=== RUN   TestBatchQueue
--- FAIL: TestBatchQueue (0.02s)

Check failure on line 1 in com/ethereum-optimism/optimism/op-node/rollup/derive

See this annotation in the file changed.

@github-actions github-actions / JUnit Test Report

com/ethereum-optimism/optimism/op-node/rollup/derive.TestBatchQueueOverlappingSpanBatch

Failed
Raw output
=== RUN   TestBatchQueueOverlappingSpanBatch
    batch_queue_test.go:818: 
        	Error Trace:	/home/runner/work/opbnb/opbnb/op-node/rollup/derive/batch_queue_test.go:818
        	Error:      	Target error should be in err chain:
        	            	expected: ""
        	            	in chain: "EOF"
        	Test:       	TestBatchQueueOverlappingSpanBatch
--- FAIL: TestBatchQueueOverlappingSpanBatch (0.00s)

Check failure on line 1 in com/ethereum-optimism/optimism/op-node/rollup/derive

See this annotation in the file changed.

@github-actions github-actions / JUnit Test Report

com/ethereum-optimism/optimism/op-node/rollup/derive.TestBatchQueueComplex

Failed
Raw output
=== RUN   TestBatchQueueComplex
    batch_queue_test.go:936: 
        	Error Trace:	/home/runner/work/opbnb/opbnb/op-node/rollup/derive/batch_queue_test.go:936
        	Error:      	Target error should be in err chain:
        	            	expected: ""
        	            	in chain: "EOF"
        	Test:       	TestBatchQueueComplex
--- FAIL: TestBatchQueueComplex (0.00s)

Check failure on line 1 in com/ethereum-optimism/optimism/op-node/rollup/derive

See this annotation in the file changed.

@github-actions github-actions / JUnit Test Report

com/ethereum-optimism/optimism/op-node/rollup/derive.TestBatchQueueResetSpan

Failed
Raw output
=== RUN   TestBatchQueueResetSpan
    batch_queue_test.go:1004: 
        	Error Trace:	/home/runner/work/opbnb/opbnb/op-node/rollup/derive/batch_queue_test.go:1004
        	Error:      	Received unexpected error:
        	            	EOF
        	Test:       	TestBatchQueueResetSpan
--- FAIL: TestBatchQueueResetSpan (0.00s)

Check failure on line 1 in com/ethereum-optimism/optimism/op-node/rollup/derive

See this annotation in the file changed.

@github-actions github-actions / JUnit Test Report

com/ethereum-optimism/optimism/op-node/rollup/derive.TestParseL1InfoDepositTxData/first-block_ecotone

Failed
Raw output
=== RUN   TestParseL1InfoDepositTxData/first-block_ecotone
    l1_block_info_test.go:148: 
        	Error Trace:	/home/runner/work/opbnb/opbnb/op-node/rollup/derive/l1_block_info_test.go:148
        	Error:      	Not equal: 
        	            	expected: 260
        	            	actual  : 164
        	Test:       	TestParseL1InfoDepositTxData/first-block_ecotone
--- FAIL: TestParseL1InfoDepositTxData/first-block_ecotone (0.00s)

Check failure on line 1 in com/ethereum-optimism/optimism/op-node/rollup/derive

See this annotation in the file changed.

@github-actions github-actions / JUnit Test Report

com/ethereum-optimism/optimism/op-node/rollup/derive.TestParseL1InfoDepositTxData

Failed
Raw output
=== RUN   TestParseL1InfoDepositTxData
--- FAIL: TestParseL1InfoDepositTxData (0.00s)

Check failure on line 1 in com/ethereum-optimism/optimism/op-node/rollup/derive

See this annotation in the file changed.

@github-actions github-actions / JUnit Test Report

com/ethereum-optimism/optimism/op-node/rollup/derive.TestSpanBatchDerive

Failed
Raw output
=== RUN   TestSpanBatchDerive
    span_batch_test.go:368: 
        	Error Trace:	/home/runner/work/opbnb/opbnb/op-node/rollup/derive/span_batch_test.go:368
        	Error:      	Not equal: 
        	            	expected: 0x28456d95
        	            	actual  : 0x9d4f321e6f
        	Test:       	TestSpanBatchDerive
--- FAIL: TestSpanBatchDerive (0.01s)

Check failure on line 1 in com/ethereum-optimism/optimism/op-node/rollup/driver

See this annotation in the file changed.

@github-actions github-actions / JUnit Test Report

com/ethereum-optimism/optimism/op-node/rollup/driver.TestSequencerChaosMonkey

Failed
Raw output
=== RUN   TestSequencerChaosMonkey
    sequencer_test.go:376: avg build time: 570.468941ms, clock timestamp: 101413, L2 head time: 2100300, L1 origin time: 104711, avg txs per block: 1.000000
    sequencer_test.go:380: 
        	Error Trace:	/home/runner/work/opbnb/opbnb/op-node/rollup/driver/sequencer_test.go:380
        	Error:      	"1995589" is not less than "100"
        	Test:       	TestSequencerChaosMonkey
        	Messages:   	The L1 origin time is close to the L2 time
--- FAIL: TestSequencerChaosMonkey (0.10s)