[GLUTEN-8912][VL] Add Offset support for CollectLimitExec #15418
54122 tests run, 7588 skipped, 13 failed.
Annotations
Check failure on line 1 in org/apache/spark/sql/GlutenConfigBehaviorSuite
github-actions / Report test results
GlutenConfigBehaviorSuite.SPARK-40211: customize initialNumPartitions for take
1 was not greater than 1
Raw output
org.scalatest.exceptions.TestFailedException: 1 was not greater than 1
at org.scalatest.Assertions.newAssertionFailedException(Assertions.scala:472)
at org.scalatest.Assertions.newAssertionFailedException$(Assertions.scala:471)
at org.scalatest.Assertions$.newAssertionFailedException(Assertions.scala:1231)
at org.scalatest.Assertions$AssertionsHelper.macroAssert(Assertions.scala:1295)
at org.apache.spark.sql.ConfigBehaviorSuite.$anonfun$new$7(ConfigBehaviorSuite.scala:92)
at scala.runtime.java8.JFunction0$mcV$sp.apply(JFunction0$mcV$sp.java:23)
at org.scalatest.OutcomeOf.outcomeOf(OutcomeOf.scala:85)
at org.scalatest.OutcomeOf.outcomeOf$(OutcomeOf.scala:83)
at org.scalatest.OutcomeOf$.outcomeOf(OutcomeOf.scala:104)
at org.scalatest.Transformer.apply(Transformer.scala:22)
at org.scalatest.Transformer.apply(Transformer.scala:20)
at org.scalatest.funsuite.AnyFunSuiteLike$$anon$1.apply(AnyFunSuiteLike.scala:226)
at org.apache.spark.SparkFunSuite.withFixture(SparkFunSuite.scala:207)
at org.scalatest.funsuite.AnyFunSuiteLike.invokeWithFixture$1(AnyFunSuiteLike.scala:224)
at org.scalatest.funsuite.AnyFunSuiteLike.$anonfun$runTest$1(AnyFunSuiteLike.scala:236)
at org.scalatest.SuperEngine.runTestImpl(Engine.scala:306)
at org.scalatest.funsuite.AnyFunSuiteLike.runTest(AnyFunSuiteLike.scala:236)
at org.scalatest.funsuite.AnyFunSuiteLike.runTest$(AnyFunSuiteLike.scala:218)
at org.apache.spark.SparkFunSuite.org$scalatest$BeforeAndAfterEach$$super$runTest(SparkFunSuite.scala:66)
at org.scalatest.BeforeAndAfterEach.runTest(BeforeAndAfterEach.scala:234)
at org.scalatest.BeforeAndAfterEach.runTest$(BeforeAndAfterEach.scala:227)
at org.apache.spark.SparkFunSuite.runTest(SparkFunSuite.scala:66)
at org.scalatest.funsuite.AnyFunSuiteLike.$anonfun$runTests$1(AnyFunSuiteLike.scala:269)
at org.scalatest.SuperEngine.$anonfun$runTestsInBranch$1(Engine.scala:413)
at scala.collection.immutable.List.foreach(List.scala:431)
at org.scalatest.SuperEngine.traverseSubNodes$1(Engine.scala:401)
at org.scalatest.SuperEngine.runTestsInBranch(Engine.scala:396)
at org.scalatest.SuperEngine.runTestsImpl(Engine.scala:475)
at org.scalatest.funsuite.AnyFunSuiteLike.runTests(AnyFunSuiteLike.scala:269)
at org.scalatest.funsuite.AnyFunSuiteLike.runTests$(AnyFunSuiteLike.scala:268)
at org.scalatest.funsuite.AnyFunSuite.runTests(AnyFunSuite.scala:1564)
at org.scalatest.Suite.run(Suite.scala:1114)
at org.scalatest.Suite.run$(Suite.scala:1096)
at org.scalatest.funsuite.AnyFunSuite.org$scalatest$funsuite$AnyFunSuiteLike$$super$run(AnyFunSuite.scala:1564)
at org.scalatest.funsuite.AnyFunSuiteLike.$anonfun$run$1(AnyFunSuiteLike.scala:273)
at org.scalatest.SuperEngine.runImpl(Engine.scala:535)
at org.scalatest.funsuite.AnyFunSuiteLike.run(AnyFunSuiteLike.scala:273)
at org.scalatest.funsuite.AnyFunSuiteLike.run$(AnyFunSuiteLike.scala:272)
at org.apache.spark.SparkFunSuite.org$scalatest$BeforeAndAfterAll$$super$run(SparkFunSuite.scala:66)
at org.scalatest.BeforeAndAfterAll.liftedTree1$1(BeforeAndAfterAll.scala:213)
at org.scalatest.BeforeAndAfterAll.run(BeforeAndAfterAll.scala:210)
at org.scalatest.BeforeAndAfterAll.run$(BeforeAndAfterAll.scala:208)
at org.apache.spark.SparkFunSuite.run(SparkFunSuite.scala:66)
at org.scalatest.Suite.callExecuteOnSuite$1(Suite.scala:1178)
at org.scalatest.Suite.$anonfun$runNestedSuites$1(Suite.scala:1225)
at scala.collection.IndexedSeqOptimized.foreach(IndexedSeqOptimized.scala:36)
at scala.collection.IndexedSeqOptimized.foreach$(IndexedSeqOptimized.scala:33)
at scala.collection.mutable.ArrayOps$ofRef.foreach(ArrayOps.scala:198)
at org.scalatest.Suite.runNestedSuites(Suite.scala:1223)
at org.scalatest.Suite.runNestedSuites$(Suite.scala:1156)
at org.scalatest.tools.DiscoverySuite.runNestedSuites(DiscoverySuite.scala:30)
at org.scalatest.Suite.run(Suite.scala:1111)
at org.scalatest.Suite.run$(Suite.scala:1096)
at org.scalatest.tools.DiscoverySuite.run(DiscoverySuite.scala:30)
at org.scalatest.tools.SuiteRunner.run(SuiteRunner.scala:47)
at org.scalatest.tools.Runner$.$anonfun$doRunRunRunDaDoRunRun$13(Runner.scala:1321)
at org.scalatest.tools.Runner$.$anonfun$doRunRunRunDaDoRunRun$13$adapted(Runner.scala:1315)
at scala.collection.immutable.List.foreach(List.scala:431)
at org.scalatest.tools.Runner$.doRunRunRunDaDoRunRun(Runner.scala:1315)
at org.scalatest.tools.Runner$.$anonfun$runOptionallyWithPassFailReporter$24(Runner.scala:992)
at org.scalatest.tools.Runner$.$anonfun$runOptionallyWithPassFailReporter$24$adapted(Runner.scala:970)
at org.scalatest.tools.Runner$.withClassLoaderAndDispatchReporter(Runner.scala:1481)
at org.scalatest.tools.Runner$.runOptionallyWithPassFailReporter(Runner.scala:970)
at org.scalatest.tools.Runner$.main(Runner.scala:775)
at org.scalatest.tools.Runner.main(Runner.scala)
Check failure on line 1 in org/apache/spark/sql/execution/adaptive/velox/VeloxAdaptiveQueryExecSuite
github-actions / Report test results
VeloxAdaptiveQueryExecSuite.SPARK-29906: AQE should not introduce extra shuffle for outermost limit
2 did not equal 1
Raw output
org.scalatest.exceptions.TestFailedException: 2 did not equal 1
at org.scalatest.Assertions.newAssertionFailedException(Assertions.scala:472)
at org.scalatest.Assertions.newAssertionFailedException$(Assertions.scala:471)
at org.scalatest.Assertions$.newAssertionFailedException(Assertions.scala:1231)
at org.scalatest.Assertions$AssertionsHelper.macroAssert(Assertions.scala:1295)
at org.apache.spark.sql.execution.adaptive.AdaptiveQueryExecSuite.$anonfun$new$62(AdaptiveQueryExecSuite.scala:761)
at org.apache.spark.sql.catalyst.plans.SQLHelper.withSQLConf(SQLHelper.scala:54)
at org.apache.spark.sql.catalyst.plans.SQLHelper.withSQLConf$(SQLHelper.scala:38)
at org.apache.spark.sql.execution.adaptive.AdaptiveQueryExecSuite.org$apache$spark$sql$test$SQLTestUtilsBase$$super$withSQLConf(AdaptiveQueryExecSuite.scala:53)
at org.apache.spark.sql.test.SQLTestUtilsBase.withSQLConf(SQLTestUtils.scala:247)
at org.apache.spark.sql.test.SQLTestUtilsBase.withSQLConf$(SQLTestUtils.scala:245)
at org.apache.spark.sql.execution.adaptive.AdaptiveQueryExecSuite.withSQLConf(AdaptiveQueryExecSuite.scala:53)
at org.apache.spark.sql.execution.adaptive.AdaptiveQueryExecSuite.$anonfun$new$61(AdaptiveQueryExecSuite.scala:756)
at org.scalatest.OutcomeOf.outcomeOf(OutcomeOf.scala:85)
at org.scalatest.OutcomeOf.outcomeOf$(OutcomeOf.scala:83)
at org.scalatest.OutcomeOf$.outcomeOf(OutcomeOf.scala:104)
at org.scalatest.Transformer.apply(Transformer.scala:22)
at org.scalatest.Transformer.apply(Transformer.scala:20)
at org.scalatest.funsuite.AnyFunSuiteLike$$anon$1.apply(AnyFunSuiteLike.scala:226)
at org.apache.spark.SparkFunSuite.withFixture(SparkFunSuite.scala:207)
at org.scalatest.funsuite.AnyFunSuiteLike.invokeWithFixture$1(AnyFunSuiteLike.scala:224)
at org.scalatest.funsuite.AnyFunSuiteLike.$anonfun$runTest$1(AnyFunSuiteLike.scala:236)
at org.scalatest.SuperEngine.runTestImpl(Engine.scala:306)
at org.scalatest.funsuite.AnyFunSuiteLike.runTest(AnyFunSuiteLike.scala:236)
at org.scalatest.funsuite.AnyFunSuiteLike.runTest$(AnyFunSuiteLike.scala:218)
at org.apache.spark.SparkFunSuite.org$scalatest$BeforeAndAfterEach$$super$runTest(SparkFunSuite.scala:66)
at org.scalatest.BeforeAndAfterEach.runTest(BeforeAndAfterEach.scala:234)
at org.scalatest.BeforeAndAfterEach.runTest$(BeforeAndAfterEach.scala:227)
at org.apache.spark.SparkFunSuite.runTest(SparkFunSuite.scala:66)
at org.scalatest.funsuite.AnyFunSuiteLike.$anonfun$runTests$1(AnyFunSuiteLike.scala:269)
at org.scalatest.SuperEngine.$anonfun$runTestsInBranch$1(Engine.scala:413)
at scala.collection.immutable.List.foreach(List.scala:431)
at org.scalatest.SuperEngine.traverseSubNodes$1(Engine.scala:401)
at org.scalatest.SuperEngine.runTestsInBranch(Engine.scala:396)
at org.scalatest.SuperEngine.runTestsImpl(Engine.scala:475)
at org.scalatest.funsuite.AnyFunSuiteLike.runTests(AnyFunSuiteLike.scala:269)
at org.scalatest.funsuite.AnyFunSuiteLike.runTests$(AnyFunSuiteLike.scala:268)
at org.scalatest.funsuite.AnyFunSuite.runTests(AnyFunSuite.scala:1564)
at org.scalatest.Suite.run(Suite.scala:1114)
at org.scalatest.Suite.run$(Suite.scala:1096)
at org.scalatest.funsuite.AnyFunSuite.org$scalatest$funsuite$AnyFunSuiteLike$$super$run(AnyFunSuite.scala:1564)
at org.scalatest.funsuite.AnyFunSuiteLike.$anonfun$run$1(AnyFunSuiteLike.scala:273)
at org.scalatest.SuperEngine.runImpl(Engine.scala:535)
at org.scalatest.funsuite.AnyFunSuiteLike.run(AnyFunSuiteLike.scala:273)
at org.scalatest.funsuite.AnyFunSuiteLike.run$(AnyFunSuiteLike.scala:272)
at org.apache.spark.SparkFunSuite.org$scalatest$BeforeAndAfterAll$$super$run(SparkFunSuite.scala:66)
at org.scalatest.BeforeAndAfterAll.liftedTree1$1(BeforeAndAfterAll.scala:213)
at org.scalatest.BeforeAndAfterAll.run(BeforeAndAfterAll.scala:210)
at org.scalatest.BeforeAndAfterAll.run$(BeforeAndAfterAll.scala:208)
at org.apache.spark.SparkFunSuite.run(SparkFunSuite.scala:66)
at org.scalatest.Suite.callExecuteOnSuite$1(Suite.scala:1178)
at org.scalatest.Suite.$anonfun$runNestedSuites$1(Suite.scala:1225)
at scala.collection.IndexedSeqOptimized.foreach(IndexedSeqOptimized.scala:36)
at scala.collection.IndexedSeqOptimized.foreach$(IndexedSeqOptimized.scala:33)
at scala.collection.mutable.ArrayOps$ofRef.foreach(ArrayOps.scala:198)
at org.scalatest.Suite.runNestedSuites(Suite.scala:1223)
at org.scalatest.Suite.runNestedSuites$(Suite.scala:1156)
at org.scalatest.tools.DiscoverySuite.runNestedSuites(DiscoverySuite.scala:30)
at org.scalatest.Suite.run(Suite.scala:1111)
at org.scalatest.Suite.run$(Suite.scala:1096)
at org.scalatest.tools.DiscoverySuite.run(DiscoverySuite.scala:30)
at org.scalatest.tools.SuiteRunner.run(SuiteRunner.scala:47)
at org.scalatest.tools.Runner$.$anonfun$doRunRunRunDaDoRunRun$13(Runner.scala:1321)
at org.scalatest.tools.Runner$.$anonfun$doRunRunRunDaDoRunRun$13$adapted(Runner.scala:1315)
at scala.collection.immutable.List.foreach(List.scala:431)
at org.scalatest.tools.Runner$.doRunRunRunDaDoRunRun(Runner.scala:1315)
at org.scalatest.tools.Runner$.$anonfun$runOptionallyWithPassFailReporter$24(Runner.scala:992)
at org.scalatest.tools.Runner$.$anonfun$runOptionallyWithPassFailReporter$24$adapted(Runner.scala:970)
at org.scalatest.tools.Runner$.withClassLoaderAndDispatchReporter(Runner.scala:1481)
at org.scalatest.tools.Runner$.runOptionallyWithPassFailReporter(Runner.scala:970)
at org.scalatest.tools.Runner$.main(Runner.scala:775)
at org.scalatest.tools.Runner.main(Runner.scala)
Check failure on line 1 in org/apache/spark/sql/GlutenConfigBehaviorSuite
github-actions / Report test results
GlutenConfigBehaviorSuite.SPARK-40211: customize initialNumPartitions for take
1 was not greater than 1
Raw output
org.scalatest.exceptions.TestFailedException: 1 was not greater than 1
at org.scalatest.Assertions.newAssertionFailedException(Assertions.scala:472)
at org.scalatest.Assertions.newAssertionFailedException$(Assertions.scala:471)
at org.scalatest.Assertions$.newAssertionFailedException(Assertions.scala:1231)
at org.scalatest.Assertions$AssertionsHelper.macroAssert(Assertions.scala:1295)
at org.apache.spark.sql.ConfigBehaviorSuite.$anonfun$new$7(ConfigBehaviorSuite.scala:92)
at scala.runtime.java8.JFunction0$mcV$sp.apply(JFunction0$mcV$sp.java:23)
at org.scalatest.OutcomeOf.outcomeOf(OutcomeOf.scala:85)
at org.scalatest.OutcomeOf.outcomeOf$(OutcomeOf.scala:83)
at org.scalatest.OutcomeOf$.outcomeOf(OutcomeOf.scala:104)
at org.scalatest.Transformer.apply(Transformer.scala:22)
at org.scalatest.Transformer.apply(Transformer.scala:20)
at org.scalatest.funsuite.AnyFunSuiteLike$$anon$1.apply(AnyFunSuiteLike.scala:226)
at org.apache.spark.SparkFunSuite.withFixture(SparkFunSuite.scala:207)
at org.scalatest.funsuite.AnyFunSuiteLike.invokeWithFixture$1(AnyFunSuiteLike.scala:224)
at org.scalatest.funsuite.AnyFunSuiteLike.$anonfun$runTest$1(AnyFunSuiteLike.scala:236)
at org.scalatest.SuperEngine.runTestImpl(Engine.scala:306)
at org.scalatest.funsuite.AnyFunSuiteLike.runTest(AnyFunSuiteLike.scala:236)
at org.scalatest.funsuite.AnyFunSuiteLike.runTest$(AnyFunSuiteLike.scala:218)
at org.apache.spark.SparkFunSuite.org$scalatest$BeforeAndAfterEach$$super$runTest(SparkFunSuite.scala:66)
at org.scalatest.BeforeAndAfterEach.runTest(BeforeAndAfterEach.scala:234)
at org.scalatest.BeforeAndAfterEach.runTest$(BeforeAndAfterEach.scala:227)
at org.apache.spark.SparkFunSuite.runTest(SparkFunSuite.scala:66)
at org.scalatest.funsuite.AnyFunSuiteLike.$anonfun$runTests$1(AnyFunSuiteLike.scala:269)
at org.scalatest.SuperEngine.$anonfun$runTestsInBranch$1(Engine.scala:413)
at scala.collection.immutable.List.foreach(List.scala:431)
at org.scalatest.SuperEngine.traverseSubNodes$1(Engine.scala:401)
at org.scalatest.SuperEngine.runTestsInBranch(Engine.scala:396)
at org.scalatest.SuperEngine.runTestsImpl(Engine.scala:475)
at org.scalatest.funsuite.AnyFunSuiteLike.runTests(AnyFunSuiteLike.scala:269)
at org.scalatest.funsuite.AnyFunSuiteLike.runTests$(AnyFunSuiteLike.scala:268)
at org.scalatest.funsuite.AnyFunSuite.runTests(AnyFunSuite.scala:1564)
at org.scalatest.Suite.run(Suite.scala:1114)
at org.scalatest.Suite.run$(Suite.scala:1096)
at org.scalatest.funsuite.AnyFunSuite.org$scalatest$funsuite$AnyFunSuiteLike$$super$run(AnyFunSuite.scala:1564)
at org.scalatest.funsuite.AnyFunSuiteLike.$anonfun$run$1(AnyFunSuiteLike.scala:273)
at org.scalatest.SuperEngine.runImpl(Engine.scala:535)
at org.scalatest.funsuite.AnyFunSuiteLike.run(AnyFunSuiteLike.scala:273)
at org.scalatest.funsuite.AnyFunSuiteLike.run$(AnyFunSuiteLike.scala:272)
at org.apache.spark.SparkFunSuite.org$scalatest$BeforeAndAfterAll$$super$run(SparkFunSuite.scala:66)
at org.scalatest.BeforeAndAfterAll.liftedTree1$1(BeforeAndAfterAll.scala:213)
at org.scalatest.BeforeAndAfterAll.run(BeforeAndAfterAll.scala:210)
at org.scalatest.BeforeAndAfterAll.run$(BeforeAndAfterAll.scala:208)
at org.apache.spark.SparkFunSuite.run(SparkFunSuite.scala:66)
at org.scalatest.Suite.callExecuteOnSuite$1(Suite.scala:1178)
at org.scalatest.Suite.$anonfun$runNestedSuites$1(Suite.scala:1225)
at scala.collection.IndexedSeqOptimized.foreach(IndexedSeqOptimized.scala:36)
at scala.collection.IndexedSeqOptimized.foreach$(IndexedSeqOptimized.scala:33)
at scala.collection.mutable.ArrayOps$ofRef.foreach(ArrayOps.scala:198)
at org.scalatest.Suite.runNestedSuites(Suite.scala:1223)
at org.scalatest.Suite.runNestedSuites$(Suite.scala:1156)
at org.scalatest.tools.DiscoverySuite.runNestedSuites(DiscoverySuite.scala:30)
at org.scalatest.Suite.run(Suite.scala:1111)
at org.scalatest.Suite.run$(Suite.scala:1096)
at org.scalatest.tools.DiscoverySuite.run(DiscoverySuite.scala:30)
at org.scalatest.tools.SuiteRunner.run(SuiteRunner.scala:47)
at org.scalatest.tools.Runner$.$anonfun$doRunRunRunDaDoRunRun$13(Runner.scala:1321)
at org.scalatest.tools.Runner$.$anonfun$doRunRunRunDaDoRunRun$13$adapted(Runner.scala:1315)
at scala.collection.immutable.List.foreach(List.scala:431)
at org.scalatest.tools.Runner$.doRunRunRunDaDoRunRun(Runner.scala:1315)
at org.scalatest.tools.Runner$.$anonfun$runOptionallyWithPassFailReporter$24(Runner.scala:992)
at org.scalatest.tools.Runner$.$anonfun$runOptionallyWithPassFailReporter$24$adapted(Runner.scala:970)
at org.scalatest.tools.Runner$.withClassLoaderAndDispatchReporter(Runner.scala:1481)
at org.scalatest.tools.Runner$.runOptionallyWithPassFailReporter(Runner.scala:970)
at org.scalatest.tools.Runner$.main(Runner.scala:775)
at org.scalatest.tools.Runner.main(Runner.scala)
Check failure on line 1 in org/apache/spark/sql/execution/adaptive/velox/VeloxAdaptiveQueryExecSuite
github-actions / Report test results
VeloxAdaptiveQueryExecSuite.SPARK-29906: AQE should not introduce extra shuffle for outermost limit
2 did not equal 1
Raw output
org.scalatest.exceptions.TestFailedException: 2 did not equal 1
at org.scalatest.Assertions.newAssertionFailedException(Assertions.scala:472)
at org.scalatest.Assertions.newAssertionFailedException$(Assertions.scala:471)
at org.scalatest.Assertions$.newAssertionFailedException(Assertions.scala:1231)
at org.scalatest.Assertions$AssertionsHelper.macroAssert(Assertions.scala:1295)
at org.apache.spark.sql.execution.adaptive.AdaptiveQueryExecSuite.$anonfun$new$62(AdaptiveQueryExecSuite.scala:761)
at org.apache.spark.sql.catalyst.plans.SQLHelper.withSQLConf(SQLHelper.scala:54)
at org.apache.spark.sql.catalyst.plans.SQLHelper.withSQLConf$(SQLHelper.scala:38)
at org.apache.spark.sql.execution.adaptive.AdaptiveQueryExecSuite.org$apache$spark$sql$test$SQLTestUtilsBase$$super$withSQLConf(AdaptiveQueryExecSuite.scala:53)
at org.apache.spark.sql.test.SQLTestUtilsBase.withSQLConf(SQLTestUtils.scala:247)
at org.apache.spark.sql.test.SQLTestUtilsBase.withSQLConf$(SQLTestUtils.scala:245)
at org.apache.spark.sql.execution.adaptive.AdaptiveQueryExecSuite.withSQLConf(AdaptiveQueryExecSuite.scala:53)
at org.apache.spark.sql.execution.adaptive.AdaptiveQueryExecSuite.$anonfun$new$61(AdaptiveQueryExecSuite.scala:756)
at org.scalatest.OutcomeOf.outcomeOf(OutcomeOf.scala:85)
at org.scalatest.OutcomeOf.outcomeOf$(OutcomeOf.scala:83)
at org.scalatest.OutcomeOf$.outcomeOf(OutcomeOf.scala:104)
at org.scalatest.Transformer.apply(Transformer.scala:22)
at org.scalatest.Transformer.apply(Transformer.scala:20)
at org.scalatest.funsuite.AnyFunSuiteLike$$anon$1.apply(AnyFunSuiteLike.scala:226)
at org.apache.spark.SparkFunSuite.withFixture(SparkFunSuite.scala:207)
at org.scalatest.funsuite.AnyFunSuiteLike.invokeWithFixture$1(AnyFunSuiteLike.scala:224)
at org.scalatest.funsuite.AnyFunSuiteLike.$anonfun$runTest$1(AnyFunSuiteLike.scala:236)
at org.scalatest.SuperEngine.runTestImpl(Engine.scala:306)
at org.scalatest.funsuite.AnyFunSuiteLike.runTest(AnyFunSuiteLike.scala:236)
at org.scalatest.funsuite.AnyFunSuiteLike.runTest$(AnyFunSuiteLike.scala:218)
at org.apache.spark.SparkFunSuite.org$scalatest$BeforeAndAfterEach$$super$runTest(SparkFunSuite.scala:66)
at org.scalatest.BeforeAndAfterEach.runTest(BeforeAndAfterEach.scala:234)
at org.scalatest.BeforeAndAfterEach.runTest$(BeforeAndAfterEach.scala:227)
at org.apache.spark.SparkFunSuite.runTest(SparkFunSuite.scala:66)
at org.scalatest.funsuite.AnyFunSuiteLike.$anonfun$runTests$1(AnyFunSuiteLike.scala:269)
at org.scalatest.SuperEngine.$anonfun$runTestsInBranch$1(Engine.scala:413)
at scala.collection.immutable.List.foreach(List.scala:431)
at org.scalatest.SuperEngine.traverseSubNodes$1(Engine.scala:401)
at org.scalatest.SuperEngine.runTestsInBranch(Engine.scala:396)
at org.scalatest.SuperEngine.runTestsImpl(Engine.scala:475)
at org.scalatest.funsuite.AnyFunSuiteLike.runTests(AnyFunSuiteLike.scala:269)
at org.scalatest.funsuite.AnyFunSuiteLike.runTests$(AnyFunSuiteLike.scala:268)
at org.scalatest.funsuite.AnyFunSuite.runTests(AnyFunSuite.scala:1564)
at org.scalatest.Suite.run(Suite.scala:1114)
at org.scalatest.Suite.run$(Suite.scala:1096)
at org.scalatest.funsuite.AnyFunSuite.org$scalatest$funsuite$AnyFunSuiteLike$$super$run(AnyFunSuite.scala:1564)
at org.scalatest.funsuite.AnyFunSuiteLike.$anonfun$run$1(AnyFunSuiteLike.scala:273)
at org.scalatest.SuperEngine.runImpl(Engine.scala:535)
at org.scalatest.funsuite.AnyFunSuiteLike.run(AnyFunSuiteLike.scala:273)
at org.scalatest.funsuite.AnyFunSuiteLike.run$(AnyFunSuiteLike.scala:272)
at org.apache.spark.SparkFunSuite.org$scalatest$BeforeAndAfterAll$$super$run(SparkFunSuite.scala:66)
at org.scalatest.BeforeAndAfterAll.liftedTree1$1(BeforeAndAfterAll.scala:213)
at org.scalatest.BeforeAndAfterAll.run(BeforeAndAfterAll.scala:210)
at org.scalatest.BeforeAndAfterAll.run$(BeforeAndAfterAll.scala:208)
at org.apache.spark.SparkFunSuite.run(SparkFunSuite.scala:66)
at org.scalatest.Suite.callExecuteOnSuite$1(Suite.scala:1178)
at org.scalatest.Suite.$anonfun$runNestedSuites$1(Suite.scala:1225)
at scala.collection.IndexedSeqOptimized.foreach(IndexedSeqOptimized.scala:36)
at scala.collection.IndexedSeqOptimized.foreach$(IndexedSeqOptimized.scala:33)
at scala.collection.mutable.ArrayOps$ofRef.foreach(ArrayOps.scala:198)
at org.scalatest.Suite.runNestedSuites(Suite.scala:1223)
at org.scalatest.Suite.runNestedSuites$(Suite.scala:1156)
at org.scalatest.tools.DiscoverySuite.runNestedSuites(DiscoverySuite.scala:30)
at org.scalatest.Suite.run(Suite.scala:1111)
at org.scalatest.Suite.run$(Suite.scala:1096)
at org.scalatest.tools.DiscoverySuite.run(DiscoverySuite.scala:30)
at org.scalatest.tools.SuiteRunner.run(SuiteRunner.scala:47)
at org.scalatest.tools.Runner$.$anonfun$doRunRunRunDaDoRunRun$13(Runner.scala:1321)
at org.scalatest.tools.Runner$.$anonfun$doRunRunRunDaDoRunRun$13$adapted(Runner.scala:1315)
at scala.collection.immutable.List.foreach(List.scala:431)
at org.scalatest.tools.Runner$.doRunRunRunDaDoRunRun(Runner.scala:1315)
at org.scalatest.tools.Runner$.$anonfun$runOptionallyWithPassFailReporter$24(Runner.scala:992)
at org.scalatest.tools.Runner$.$anonfun$runOptionallyWithPassFailReporter$24$adapted(Runner.scala:970)
at org.scalatest.tools.Runner$.withClassLoaderAndDispatchReporter(Runner.scala:1481)
at org.scalatest.tools.Runner$.runOptionallyWithPassFailReporter(Runner.scala:970)
at org.scalatest.tools.Runner$.main(Runner.scala:775)
at org.scalatest.tools.Runner.main(Runner.scala)
Check failure on line 341 in org/apache/spark/sql/GlutenSQLQueryTestSuite
github-actions / Report test results
GlutenSQLQueryTestSuite.subquery/in-subquery/in-limit.sql
subquery/in-subquery/in-limit.sql
Expected "[val1e 10 NULL 19 17.0 25.0 2600 2014-05-04 01:01:00 2014-05-04
val1e 10 NULL 19 17.0 25.0 2600 2014-09-04 01:02:00.001 2014-09-04]", but got "[]" Result did not match for query #13
SELECT *
FROM t1
WHERE t1a IN (SELECT t2a
FROM t2
WHERE t1d = t2d)
OFFSET 2
Raw output
org.scalatest.exceptions.TestFailedException: subquery/in-subquery/in-limit.sql
Expected "[val1e 10 NULL 19 17.0 25.0 2600 2014-05-04 01:01:00 2014-05-04
val1e 10 NULL 19 17.0 25.0 2600 2014-09-04 01:02:00.001 2014-09-04]", but got "[]" Result did not match for query #13
SELECT *
FROM t1
WHERE t1a IN (SELECT t2a
FROM t2
WHERE t1d = t2d)
OFFSET 2
at org.scalatest.Assertions.newAssertionFailedException(Assertions.scala:472)
at org.scalatest.Assertions.newAssertionFailedException$(Assertions.scala:471)
at org.scalatest.funsuite.AnyFunSuite.newAssertionFailedException(AnyFunSuite.scala:1564)
at org.scalatest.Assertions.assertResult(Assertions.scala:847)
at org.scalatest.Assertions.assertResult$(Assertions.scala:842)
at org.scalatest.funsuite.AnyFunSuite.assertResult(AnyFunSuite.scala:1564)
at org.apache.spark.sql.GlutenSQLQueryTestSuite.$anonfun$runQueries$11(GlutenSQLQueryTestSuite.scala:586)
at scala.collection.mutable.ResizableArray.foreach(ResizableArray.scala:62)
at scala.collection.mutable.ResizableArray.foreach$(ResizableArray.scala:55)
at scala.collection.mutable.ArrayBuffer.foreach(ArrayBuffer.scala:49)
at org.apache.spark.sql.GlutenSQLQueryTestSuite.$anonfun$runQueries$9(GlutenSQLQueryTestSuite.scala:573)
at scala.runtime.java8.JFunction0$mcV$sp.apply(JFunction0$mcV$sp.java:23)
at org.scalatest.Assertions.withClue(Assertions.scala:1065)
at org.scalatest.Assertions.withClue$(Assertions.scala:1052)
at org.scalatest.funsuite.AnyFunSuite.withClue(AnyFunSuite.scala:1564)
at org.apache.spark.sql.GlutenSQLQueryTestSuite.runQueries(GlutenSQLQueryTestSuite.scala:547)
at org.apache.spark.sql.GlutenSQLQueryTestSuite.$anonfun$runTest$34(GlutenSQLQueryTestSuite.scala:454)
at org.apache.spark.sql.GlutenSQLQueryTestSuite.$anonfun$runTest$34$adapted(GlutenSQLQueryTestSuite.scala:452)
at scala.collection.mutable.ResizableArray.foreach(ResizableArray.scala:62)
at scala.collection.mutable.ResizableArray.foreach$(ResizableArray.scala:55)
at scala.collection.mutable.ArrayBuffer.foreach(ArrayBuffer.scala:49)
at org.apache.spark.sql.GlutenSQLQueryTestSuite.runTest(GlutenSQLQueryTestSuite.scala:452)
at org.apache.spark.sql.GlutenSQLQueryTestSuite.$anonfun$createScalaTestCase$6(GlutenSQLQueryTestSuite.scala:341)
at scala.runtime.java8.JFunction0$mcV$sp.apply(JFunction0$mcV$sp.java:23)
at org.scalatest.OutcomeOf.outcomeOf(OutcomeOf.scala:85)
at org.scalatest.OutcomeOf.outcomeOf$(OutcomeOf.scala:83)
at org.scalatest.OutcomeOf$.outcomeOf(OutcomeOf.scala:104)
at org.scalatest.Transformer.apply(Transformer.scala:22)
at org.scalatest.Transformer.apply(Transformer.scala:20)
at org.scalatest.funsuite.AnyFunSuiteLike$$anon$1.apply(AnyFunSuiteLike.scala:226)
at org.apache.spark.SparkFunSuite.withFixture(SparkFunSuite.scala:207)
at org.scalatest.funsuite.AnyFunSuiteLike.invokeWithFixture$1(AnyFunSuiteLike.scala:224)
at org.scalatest.funsuite.AnyFunSuiteLike.$anonfun$runTest$1(AnyFunSuiteLike.scala:236)
at org.scalatest.SuperEngine.runTestImpl(Engine.scala:306)
at org.scalatest.funsuite.AnyFunSuiteLike.runTest(AnyFunSuiteLike.scala:236)
at org.scalatest.funsuite.AnyFunSuiteLike.runTest$(AnyFunSuiteLike.scala:218)
at org.apache.spark.SparkFunSuite.org$scalatest$BeforeAndAfterEach$$super$runTest(SparkFunSuite.scala:66)
at org.scalatest.BeforeAndAfterEach.runTest(BeforeAndAfterEach.scala:234)
at org.scalatest.BeforeAndAfterEach.runTest$(BeforeAndAfterEach.scala:227)
at org.apache.spark.SparkFunSuite.runTest(SparkFunSuite.scala:66)
at org.scalatest.funsuite.AnyFunSuiteLike.$anonfun$runTests$1(AnyFunSuiteLike.scala:269)
at org.scalatest.SuperEngine.$anonfun$runTestsInBranch$1(Engine.scala:413)
at scala.collection.immutable.List.foreach(List.scala:431)
at org.scalatest.SuperEngine.traverseSubNodes$1(Engine.scala:401)
at org.scalatest.SuperEngine.runTestsInBranch(Engine.scala:396)
at org.scalatest.SuperEngine.runTestsImpl(Engine.scala:475)
at org.scalatest.funsuite.AnyFunSuiteLike.runTests(AnyFunSuiteLike.scala:269)
at org.scalatest.funsuite.AnyFunSuiteLike.runTests$(AnyFunSuiteLike.scala:268)
at org.scalatest.funsuite.AnyFunSuite.runTests(AnyFunSuite.scala:1564)
at org.scalatest.Suite.run(Suite.scala:1114)
at org.scalatest.Suite.run$(Suite.scala:1096)
at org.scalatest.funsuite.AnyFunSuite.org$scalatest$funsuite$AnyFunSuiteLike$$super$run(AnyFunSuite.scala:1564)
at org.scalatest.funsuite.AnyFunSuiteLike.$anonfun$run$1(AnyFunSuiteLike.scala:273)
at org.scalatest.SuperEngine.runImpl(Engine.scala:535)
at org.scalatest.funsuite.AnyFunSuiteLike.run(AnyFunSuiteLike.scala:273)
at org.scalatest.funsuite.AnyFunSuiteLike.run$(AnyFunSuiteLike.scala:272)
at org.apache.spark.SparkFunSuite.org$scalatest$BeforeAndAfterAll$$super$run(SparkFunSuite.scala:66)
at org.scalatest.BeforeAndAfterAll.liftedTree1$1(BeforeAndAfterAll.scala:213)
at org.scalatest.BeforeAndAfterAll.run(BeforeAndAfterAll.scala:210)
at org.scalatest.BeforeAndAfterAll.run$(BeforeAndAfterAll.scala:208)
at org.apache.spark.SparkFunSuite.run(SparkFunSuite.scala:66)
at org.scalatest.Suite.callExecuteOnSuite$1(Suite.scala:1178)
at org.scalatest.Suite.$anonfun$runNestedSuites$1(Suite.scala:1225)
at scala.collection.IndexedSeqOptimized.foreach(IndexedSeqOptimized.scala:36)
at scala.collection.IndexedSeqOptimized.foreach$(IndexedSeqOptimized.scala:33)
at scala.collection.mutable.ArrayOps$ofRef.foreach(ArrayOps.scala:198)
at org.scalatest.Suite.runNestedSuites(Suite.scala:1223)
at org.scalatest.Suite.runNestedSuites$(Suite.scala:1156)
at org.scalatest.tools.DiscoverySuite.runNestedSuites(DiscoverySuite.scala:30)
at org.scalatest.Suite.run(Suite.scala:1111)
at org.scalatest.Suite.run$(Suite.scala:1096)
at org.scalatest.tools.DiscoverySuite.run(DiscoverySuite.scala:30)
at org.scalatest.tools.SuiteRunner.run(SuiteRunner.scala:47)
at org.scalatest.tools.Runner$.$anonfun$doRunRunRunDaDoRunRun$13(Runner.scala:1321)
at org.scalatest.tools.Runner$.$anonfun$doRunRunRunDaDoRunRun$13$adapted(Runner.scala:1315)
at scala.collection.immutable.List.foreach(List.scala:431)
at org.scalatest.tools.Runner$.doRunRunRunDaDoRunRun(Runner.scala:1315)
at org.scalatest.tools.Runner$.$anonfun$runOptionallyWithPassFailReporter$24(Runner.scala:992)
at org.scalatest.tools.Runner$.$anonfun$runOptionallyWithPassFailReporter$24$adapted(Runner.scala:970)
at org.scalatest.tools.Runner$.withClassLoaderAndDispatchReporter(Runner.scala:1481)
at org.scalatest.tools.Runner$.runOptionallyWithPassFailReporter(Runner.scala:970)
at org.scalatest.tools.Runner$.main(Runner.scala:775)
at org.scalatest.tools.Runner.main(Runner.scala)
Check failure on line 341 in org/apache/spark/sql/GlutenSQLQueryTestSuite
github-actions / Report test results
GlutenSQLQueryTestSuite.subquery/in-subquery/in-limit.sql
subquery/in-subquery/in-limit.sql
Expected "[val1e 10 NULL 19 17.0 25.0 2600 2014-05-04 01:01:00 2014-05-04
val1e 10 NULL 19 17.0 25.0 2600 2014-09-04 01:02:00.001 2014-09-04]", but got "[]" Result did not match for query #13
SELECT *
FROM t1
WHERE t1a IN (SELECT t2a
FROM t2
WHERE t1d = t2d)
OFFSET 2
Raw output
org.scalatest.exceptions.TestFailedException: subquery/in-subquery/in-limit.sql
Expected "[val1e 10 NULL 19 17.0 25.0 2600 2014-05-04 01:01:00 2014-05-04
val1e 10 NULL 19 17.0 25.0 2600 2014-09-04 01:02:00.001 2014-09-04]", but got "[]" Result did not match for query #13
SELECT *
FROM t1
WHERE t1a IN (SELECT t2a
FROM t2
WHERE t1d = t2d)
OFFSET 2
at org.scalatest.Assertions.newAssertionFailedException(Assertions.scala:472)
at org.scalatest.Assertions.newAssertionFailedException$(Assertions.scala:471)
at org.scalatest.funsuite.AnyFunSuite.newAssertionFailedException(AnyFunSuite.scala:1564)
at org.scalatest.Assertions.assertResult(Assertions.scala:847)
at org.scalatest.Assertions.assertResult$(Assertions.scala:842)
at org.scalatest.funsuite.AnyFunSuite.assertResult(AnyFunSuite.scala:1564)
at org.apache.spark.sql.GlutenSQLQueryTestSuite.$anonfun$runQueries$11(GlutenSQLQueryTestSuite.scala:586)
at scala.collection.mutable.ResizableArray.foreach(ResizableArray.scala:62)
at scala.collection.mutable.ResizableArray.foreach$(ResizableArray.scala:55)
at scala.collection.mutable.ArrayBuffer.foreach(ArrayBuffer.scala:49)
at org.apache.spark.sql.GlutenSQLQueryTestSuite.$anonfun$runQueries$9(GlutenSQLQueryTestSuite.scala:573)
at scala.runtime.java8.JFunction0$mcV$sp.apply(JFunction0$mcV$sp.java:23)
at org.scalatest.Assertions.withClue(Assertions.scala:1065)
at org.scalatest.Assertions.withClue$(Assertions.scala:1052)
at org.scalatest.funsuite.AnyFunSuite.withClue(AnyFunSuite.scala:1564)
at org.apache.spark.sql.GlutenSQLQueryTestSuite.runQueries(GlutenSQLQueryTestSuite.scala:547)
at org.apache.spark.sql.GlutenSQLQueryTestSuite.$anonfun$runTest$34(GlutenSQLQueryTestSuite.scala:454)
at org.apache.spark.sql.GlutenSQLQueryTestSuite.$anonfun$runTest$34$adapted(GlutenSQLQueryTestSuite.scala:452)
at scala.collection.mutable.ResizableArray.foreach(ResizableArray.scala:62)
at scala.collection.mutable.ResizableArray.foreach$(ResizableArray.scala:55)
at scala.collection.mutable.ArrayBuffer.foreach(ArrayBuffer.scala:49)
at org.apache.spark.sql.GlutenSQLQueryTestSuite.runTest(GlutenSQLQueryTestSuite.scala:452)
at org.apache.spark.sql.GlutenSQLQueryTestSuite.$anonfun$createScalaTestCase$6(GlutenSQLQueryTestSuite.scala:341)
at scala.runtime.java8.JFunction0$mcV$sp.apply(JFunction0$mcV$sp.java:23)
at org.scalatest.OutcomeOf.outcomeOf(OutcomeOf.scala:85)
at org.scalatest.OutcomeOf.outcomeOf$(OutcomeOf.scala:83)
at org.scalatest.OutcomeOf$.outcomeOf(OutcomeOf.scala:104)
at org.scalatest.Transformer.apply(Transformer.scala:22)
at org.scalatest.Transformer.apply(Transformer.scala:20)
at org.scalatest.funsuite.AnyFunSuiteLike$$anon$1.apply(AnyFunSuiteLike.scala:226)
at org.apache.spark.SparkFunSuite.withFixture(SparkFunSuite.scala:207)
at org.scalatest.funsuite.AnyFunSuiteLike.invokeWithFixture$1(AnyFunSuiteLike.scala:224)
at org.scalatest.funsuite.AnyFunSuiteLike.$anonfun$runTest$1(AnyFunSuiteLike.scala:236)
at org.scalatest.SuperEngine.runTestImpl(Engine.scala:306)
at org.scalatest.funsuite.AnyFunSuiteLike.runTest(AnyFunSuiteLike.scala:236)
at org.scalatest.funsuite.AnyFunSuiteLike.runTest$(AnyFunSuiteLike.scala:218)
at org.apache.spark.SparkFunSuite.org$scalatest$BeforeAndAfterEach$$super$runTest(SparkFunSuite.scala:66)
at org.scalatest.BeforeAndAfterEach.runTest(BeforeAndAfterEach.scala:234)
at org.scalatest.BeforeAndAfterEach.runTest$(BeforeAndAfterEach.scala:227)
at org.apache.spark.SparkFunSuite.runTest(SparkFunSuite.scala:66)
at org.scalatest.funsuite.AnyFunSuiteLike.$anonfun$runTests$1(AnyFunSuiteLike.scala:269)
at org.scalatest.SuperEngine.$anonfun$runTestsInBranch$1(Engine.scala:413)
at scala.collection.immutable.List.foreach(List.scala:431)
at org.scalatest.SuperEngine.traverseSubNodes$1(Engine.scala:401)
at org.scalatest.SuperEngine.runTestsInBranch(Engine.scala:396)
at org.scalatest.SuperEngine.runTestsImpl(Engine.scala:475)
at org.scalatest.funsuite.AnyFunSuiteLike.runTests(AnyFunSuiteLike.scala:269)
at org.scalatest.funsuite.AnyFunSuiteLike.runTests$(AnyFunSuiteLike.scala:268)
at org.scalatest.funsuite.AnyFunSuite.runTests(AnyFunSuite.scala:1564)
at org.scalatest.Suite.run(Suite.scala:1114)
at org.scalatest.Suite.run$(Suite.scala:1096)
at org.scalatest.funsuite.AnyFunSuite.org$scalatest$funsuite$AnyFunSuiteLike$$super$run(AnyFunSuite.scala:1564)
at org.scalatest.funsuite.AnyFunSuiteLike.$anonfun$run$1(AnyFunSuiteLike.scala:273)
at org.scalatest.SuperEngine.runImpl(Engine.scala:535)
at org.scalatest.funsuite.AnyFunSuiteLike.run(AnyFunSuiteLike.scala:273)
at org.scalatest.funsuite.AnyFunSuiteLike.run$(AnyFunSuiteLike.scala:272)
at org.apache.spark.SparkFunSuite.org$scalatest$BeforeAndAfterAll$$super$run(SparkFunSuite.scala:66)
at org.scalatest.BeforeAndAfterAll.liftedTree1$1(BeforeAndAfterAll.scala:213)
at org.scalatest.BeforeAndAfterAll.run(BeforeAndAfterAll.scala:210)
at org.scalatest.BeforeAndAfterAll.run$(BeforeAndAfterAll.scala:208)
at org.apache.spark.SparkFunSuite.run(SparkFunSuite.scala:66)
at org.scalatest.Suite.callExecuteOnSuite$1(Suite.scala:1178)
at org.scalatest.Suite.$anonfun$runNestedSuites$1(Suite.scala:1225)
at scala.collection.IndexedSeqOptimized.foreach(IndexedSeqOptimized.scala:36)
at scala.collection.IndexedSeqOptimized.foreach$(IndexedSeqOptimized.scala:33)
at scala.collection.mutable.ArrayOps$ofRef.foreach(ArrayOps.scala:198)
at org.scalatest.Suite.runNestedSuites(Suite.scala:1223)
at org.scalatest.Suite.runNestedSuites$(Suite.scala:1156)
at org.scalatest.tools.DiscoverySuite.runNestedSuites(DiscoverySuite.scala:30)
at org.scalatest.Suite.run(Suite.scala:1111)
at org.scalatest.Suite.run$(Suite.scala:1096)
at org.scalatest.tools.DiscoverySuite.run(DiscoverySuite.scala:30)
at org.scalatest.tools.SuiteRunner.run(SuiteRunner.scala:47)
at org.scalatest.tools.Runner$.$anonfun$doRunRunRunDaDoRunRun$13(Runner.scala:1321)
at org.scalatest.tools.Runner$.$anonfun$doRunRunRunDaDoRunRun$13$adapted(Runner.scala:1315)
at scala.collection.immutable.List.foreach(List.scala:431)
at org.scalatest.tools.Runner$.doRunRunRunDaDoRunRun(Runner.scala:1315)
at org.scalatest.tools.Runner$.$anonfun$runOptionallyWithPassFailReporter$24(Runner.scala:992)
at org.scalatest.tools.Runner$.$anonfun$runOptionallyWithPassFailReporter$24$adapted(Runner.scala:970)
at org.scalatest.tools.Runner$.withClassLoaderAndDispatchReporter(Runner.scala:1481)
at org.scalatest.tools.Runner$.runOptionallyWithPassFailReporter(Runner.scala:970)
at org.scalatest.tools.Runner$.main(Runner.scala:775)
at org.scalatest.tools.Runner.main(Runner.scala)
Check failure on line 1 in org/apache/spark/sql/GlutenConfigBehaviorSuite
github-actions / Report test results
GlutenConfigBehaviorSuite.SPARK-40211: customize initialNumPartitions for take
1 was not greater than 1
Raw output
org.scalatest.exceptions.TestFailedException: 1 was not greater than 1
at org.scalatest.Assertions.newAssertionFailedException(Assertions.scala:472)
at org.scalatest.Assertions.newAssertionFailedException$(Assertions.scala:471)
at org.scalatest.Assertions$.newAssertionFailedException(Assertions.scala:1231)
at org.scalatest.Assertions$AssertionsHelper.macroAssert(Assertions.scala:1295)
at org.apache.spark.sql.ConfigBehaviorSuite.$anonfun$new$7(ConfigBehaviorSuite.scala:92)
at scala.runtime.java8.JFunction0$mcV$sp.apply(JFunction0$mcV$sp.java:23)
at org.scalatest.enablers.Timed$$anon$1.timeoutAfter(Timed.scala:127)
at org.scalatest.concurrent.TimeLimits$.failAfterImpl(TimeLimits.scala:282)
at org.scalatest.concurrent.TimeLimits.failAfter(TimeLimits.scala:231)
at org.scalatest.concurrent.TimeLimits.failAfter$(TimeLimits.scala:230)
at org.apache.spark.SparkFunSuite.failAfter(SparkFunSuite.scala:69)
at org.apache.spark.SparkFunSuite.$anonfun$test$2(SparkFunSuite.scala:155)
at org.scalatest.OutcomeOf.outcomeOf(OutcomeOf.scala:85)
at org.scalatest.OutcomeOf.outcomeOf$(OutcomeOf.scala:83)
at org.scalatest.OutcomeOf$.outcomeOf(OutcomeOf.scala:104)
at org.scalatest.Transformer.apply(Transformer.scala:22)
at org.scalatest.Transformer.apply(Transformer.scala:20)
at org.scalatest.funsuite.AnyFunSuiteLike$$anon$1.apply(AnyFunSuiteLike.scala:226)
at org.apache.spark.SparkFunSuite.withFixture(SparkFunSuite.scala:227)
at org.scalatest.funsuite.AnyFunSuiteLike.invokeWithFixture$1(AnyFunSuiteLike.scala:224)
at org.scalatest.funsuite.AnyFunSuiteLike.$anonfun$runTest$1(AnyFunSuiteLike.scala:236)
at org.scalatest.SuperEngine.runTestImpl(Engine.scala:306)
at org.scalatest.funsuite.AnyFunSuiteLike.runTest(AnyFunSuiteLike.scala:236)
at org.scalatest.funsuite.AnyFunSuiteLike.runTest$(AnyFunSuiteLike.scala:218)
at org.apache.spark.SparkFunSuite.org$scalatest$BeforeAndAfterEach$$super$runTest(SparkFunSuite.scala:69)
at org.scalatest.BeforeAndAfterEach.runTest(BeforeAndAfterEach.scala:234)
at org.scalatest.BeforeAndAfterEach.runTest$(BeforeAndAfterEach.scala:227)
at org.apache.spark.SparkFunSuite.runTest(SparkFunSuite.scala:69)
at org.scalatest.funsuite.AnyFunSuiteLike.$anonfun$runTests$1(AnyFunSuiteLike.scala:269)
at org.scalatest.SuperEngine.$anonfun$runTestsInBranch$1(Engine.scala:413)
at scala.collection.immutable.List.foreach(List.scala:431)
at org.scalatest.SuperEngine.traverseSubNodes$1(Engine.scala:401)
at org.scalatest.SuperEngine.runTestsInBranch(Engine.scala:396)
at org.scalatest.SuperEngine.runTestsImpl(Engine.scala:475)
at org.scalatest.funsuite.AnyFunSuiteLike.runTests(AnyFunSuiteLike.scala:269)
at org.scalatest.funsuite.AnyFunSuiteLike.runTests$(AnyFunSuiteLike.scala:268)
at org.scalatest.funsuite.AnyFunSuite.runTests(AnyFunSuite.scala:1564)
at org.scalatest.Suite.run(Suite.scala:1114)
at org.scalatest.Suite.run$(Suite.scala:1096)
at org.scalatest.funsuite.AnyFunSuite.org$scalatest$funsuite$AnyFunSuiteLike$$super$run(AnyFunSuite.scala:1564)
at org.scalatest.funsuite.AnyFunSuiteLike.$anonfun$run$1(AnyFunSuiteLike.scala:273)
at org.scalatest.SuperEngine.runImpl(Engine.scala:535)
at org.scalatest.funsuite.AnyFunSuiteLike.run(AnyFunSuiteLike.scala:273)
at org.scalatest.funsuite.AnyFunSuiteLike.run$(AnyFunSuiteLike.scala:272)
at org.apache.spark.SparkFunSuite.org$scalatest$BeforeAndAfterAll$$super$run(SparkFunSuite.scala:69)
at org.scalatest.BeforeAndAfterAll.liftedTree1$1(BeforeAndAfterAll.scala:213)
at org.scalatest.BeforeAndAfterAll.run(BeforeAndAfterAll.scala:210)
at org.scalatest.BeforeAndAfterAll.run$(BeforeAndAfterAll.scala:208)
at org.apache.spark.SparkFunSuite.run(SparkFunSuite.scala:69)
at org.scalatest.Suite.callExecuteOnSuite$1(Suite.scala:1178)
at org.scalatest.Suite.$anonfun$runNestedSuites$1(Suite.scala:1225)
at scala.collection.IndexedSeqOptimized.foreach(IndexedSeqOptimized.scala:36)
at scala.collection.IndexedSeqOptimized.foreach$(IndexedSeqOptimized.scala:33)
at scala.collection.mutable.ArrayOps$ofRef.foreach(ArrayOps.scala:198)
at org.scalatest.Suite.runNestedSuites(Suite.scala:1223)
at org.scalatest.Suite.runNestedSuites$(Suite.scala:1156)
at org.scalatest.tools.DiscoverySuite.runNestedSuites(DiscoverySuite.scala:30)
at org.scalatest.Suite.run(Suite.scala:1111)
at org.scalatest.Suite.run$(Suite.scala:1096)
at org.scalatest.tools.DiscoverySuite.run(DiscoverySuite.scala:30)
at org.scalatest.tools.SuiteRunner.run(SuiteRunner.scala:47)
at org.scalatest.tools.Runner$.$anonfun$doRunRunRunDaDoRunRun$13(Runner.scala:1321)
at org.scalatest.tools.Runner$.$anonfun$doRunRunRunDaDoRunRun$13$adapted(Runner.scala:1315)
at scala.collection.immutable.List.foreach(List.scala:431)
at org.scalatest.tools.Runner$.doRunRunRunDaDoRunRun(Runner.scala:1315)
at org.scalatest.tools.Runner$.$anonfun$runOptionallyWithPassFailReporter$24(Runner.scala:992)
at org.scalatest.tools.Runner$.$anonfun$runOptionallyWithPassFailReporter$24$adapted(Runner.scala:970)
at org.scalatest.tools.Runner$.withClassLoaderAndDispatchReporter(Runner.scala:1481)
at org.scalatest.tools.Runner$.runOptionallyWithPassFailReporter(Runner.scala:970)
at org.scalatest.tools.Runner$.main(Runner.scala:775)
at org.scalatest.tools.Runner.main(Runner.scala)
Check failure on line 1 in org/apache/spark/sql/execution/adaptive/velox/VeloxAdaptiveQueryExecSuite
github-actions / Report test results
VeloxAdaptiveQueryExecSuite.SPARK-29906: AQE should not introduce extra shuffle for outermost limit
2 did not equal 1
Raw output
org.scalatest.exceptions.TestFailedException: 2 did not equal 1
at org.scalatest.Assertions.newAssertionFailedException(Assertions.scala:472)
at org.scalatest.Assertions.newAssertionFailedException$(Assertions.scala:471)
at org.scalatest.Assertions$.newAssertionFailedException(Assertions.scala:1231)
at org.scalatest.Assertions$AssertionsHelper.macroAssert(Assertions.scala:1295)
at org.apache.spark.sql.execution.adaptive.AdaptiveQueryExecSuite.$anonfun$new$62(AdaptiveQueryExecSuite.scala:770)
at org.apache.spark.sql.catalyst.plans.SQLHelper.withSQLConf(SQLHelper.scala:54)
at org.apache.spark.sql.catalyst.plans.SQLHelper.withSQLConf$(SQLHelper.scala:38)
at org.apache.spark.sql.execution.adaptive.AdaptiveQueryExecSuite.org$apache$spark$sql$test$SQLTestUtilsBase$$super$withSQLConf(AdaptiveQueryExecSuite.scala:54)
at org.apache.spark.sql.test.SQLTestUtilsBase.withSQLConf(SQLTestUtils.scala:247)
at org.apache.spark.sql.test.SQLTestUtilsBase.withSQLConf$(SQLTestUtils.scala:245)
at org.apache.spark.sql.execution.adaptive.AdaptiveQueryExecSuite.withSQLConf(AdaptiveQueryExecSuite.scala:54)
at org.apache.spark.sql.execution.adaptive.AdaptiveQueryExecSuite.$anonfun$new$61(AdaptiveQueryExecSuite.scala:765)
at org.scalatest.enablers.Timed$$anon$1.timeoutAfter(Timed.scala:127)
at org.scalatest.concurrent.TimeLimits$.failAfterImpl(TimeLimits.scala:282)
at org.scalatest.concurrent.TimeLimits.failAfter(TimeLimits.scala:231)
at org.scalatest.concurrent.TimeLimits.failAfter$(TimeLimits.scala:230)
at org.apache.spark.SparkFunSuite.failAfter(SparkFunSuite.scala:69)
at org.apache.spark.SparkFunSuite.$anonfun$test$2(SparkFunSuite.scala:155)
at org.scalatest.OutcomeOf.outcomeOf(OutcomeOf.scala:85)
at org.scalatest.OutcomeOf.outcomeOf$(OutcomeOf.scala:83)
at org.scalatest.OutcomeOf$.outcomeOf(OutcomeOf.scala:104)
at org.scalatest.Transformer.apply(Transformer.scala:22)
at org.scalatest.Transformer.apply(Transformer.scala:20)
at org.scalatest.funsuite.AnyFunSuiteLike$$anon$1.apply(AnyFunSuiteLike.scala:226)
at org.apache.spark.SparkFunSuite.withFixture(SparkFunSuite.scala:227)
at org.scalatest.funsuite.AnyFunSuiteLike.invokeWithFixture$1(AnyFunSuiteLike.scala:224)
at org.scalatest.funsuite.AnyFunSuiteLike.$anonfun$runTest$1(AnyFunSuiteLike.scala:236)
at org.scalatest.SuperEngine.runTestImpl(Engine.scala:306)
at org.scalatest.funsuite.AnyFunSuiteLike.runTest(AnyFunSuiteLike.scala:236)
at org.scalatest.funsuite.AnyFunSuiteLike.runTest$(AnyFunSuiteLike.scala:218)
at org.apache.spark.SparkFunSuite.org$scalatest$BeforeAndAfterEach$$super$runTest(SparkFunSuite.scala:69)
at org.scalatest.BeforeAndAfterEach.runTest(BeforeAndAfterEach.scala:234)
at org.scalatest.BeforeAndAfterEach.runTest$(BeforeAndAfterEach.scala:227)
at org.apache.spark.SparkFunSuite.runTest(SparkFunSuite.scala:69)
at org.scalatest.funsuite.AnyFunSuiteLike.$anonfun$runTests$1(AnyFunSuiteLike.scala:269)
at org.scalatest.SuperEngine.$anonfun$runTestsInBranch$1(Engine.scala:413)
at scala.collection.immutable.List.foreach(List.scala:431)
at org.scalatest.SuperEngine.traverseSubNodes$1(Engine.scala:401)
at org.scalatest.SuperEngine.runTestsInBranch(Engine.scala:396)
at org.scalatest.SuperEngine.runTestsImpl(Engine.scala:475)
at org.scalatest.funsuite.AnyFunSuiteLike.runTests(AnyFunSuiteLike.scala:269)
at org.scalatest.funsuite.AnyFunSuiteLike.runTests$(AnyFunSuiteLike.scala:268)
at org.scalatest.funsuite.AnyFunSuite.runTests(AnyFunSuite.scala:1564)
at org.scalatest.Suite.run(Suite.scala:1114)
at org.scalatest.Suite.run$(Suite.scala:1096)
at org.scalatest.funsuite.AnyFunSuite.org$scalatest$funsuite$AnyFunSuiteLike$$super$run(AnyFunSuite.scala:1564)
at org.scalatest.funsuite.AnyFunSuiteLike.$anonfun$run$1(AnyFunSuiteLike.scala:273)
at org.scalatest.SuperEngine.runImpl(Engine.scala:535)
at org.scalatest.funsuite.AnyFunSuiteLike.run(AnyFunSuiteLike.scala:273)
at org.scalatest.funsuite.AnyFunSuiteLike.run$(AnyFunSuiteLike.scala:272)
at org.apache.spark.SparkFunSuite.org$scalatest$BeforeAndAfterAll$$super$run(SparkFunSuite.scala:69)
at org.scalatest.BeforeAndAfterAll.liftedTree1$1(BeforeAndAfterAll.scala:213)
at org.scalatest.BeforeAndAfterAll.run(BeforeAndAfterAll.scala:210)
at org.scalatest.BeforeAndAfterAll.run$(BeforeAndAfterAll.scala:208)
at org.apache.spark.SparkFunSuite.run(SparkFunSuite.scala:69)
at org.scalatest.Suite.callExecuteOnSuite$1(Suite.scala:1178)
at org.scalatest.Suite.$anonfun$runNestedSuites$1(Suite.scala:1225)
at scala.collection.IndexedSeqOptimized.foreach(IndexedSeqOptimized.scala:36)
at scala.collection.IndexedSeqOptimized.foreach$(IndexedSeqOptimized.scala:33)
at scala.collection.mutable.ArrayOps$ofRef.foreach(ArrayOps.scala:198)
at org.scalatest.Suite.runNestedSuites(Suite.scala:1223)
at org.scalatest.Suite.runNestedSuites$(Suite.scala:1156)
at org.scalatest.tools.DiscoverySuite.runNestedSuites(DiscoverySuite.scala:30)
at org.scalatest.Suite.run(Suite.scala:1111)
at org.scalatest.Suite.run$(Suite.scala:1096)
at org.scalatest.tools.DiscoverySuite.run(DiscoverySuite.scala:30)
at org.scalatest.tools.SuiteRunner.run(SuiteRunner.scala:47)
at org.scalatest.tools.Runner$.$anonfun$doRunRunRunDaDoRunRun$13(Runner.scala:1321)
at org.scalatest.tools.Runner$.$anonfun$doRunRunRunDaDoRunRun$13$adapted(Runner.scala:1315)
at scala.collection.immutable.List.foreach(List.scala:431)
at org.scalatest.tools.Runner$.doRunRunRunDaDoRunRun(Runner.scala:1315)
at org.scalatest.tools.Runner$.$anonfun$runOptionallyWithPassFailReporter$24(Runner.scala:992)
at org.scalatest.tools.Runner$.$anonfun$runOptionallyWithPassFailReporter$24$adapted(Runner.scala:970)
at org.scalatest.tools.Runner$.withClassLoaderAndDispatchReporter(Runner.scala:1481)
at org.scalatest.tools.Runner$.runOptionallyWithPassFailReporter(Runner.scala:970)
at org.scalatest.tools.Runner$.main(Runner.scala:775)
at org.scalatest.tools.Runner.main(Runner.scala)
Check failure on line 1 in org/apache/spark/sql/GlutenConfigBehaviorSuite
github-actions / Report test results
GlutenConfigBehaviorSuite.SPARK-40211: customize initialNumPartitions for take
1 was not greater than 1
Raw output
org.scalatest.exceptions.TestFailedException: 1 was not greater than 1
at org.scalatest.Assertions.newAssertionFailedException(Assertions.scala:472)
at org.scalatest.Assertions.newAssertionFailedException$(Assertions.scala:471)
at org.scalatest.Assertions$.newAssertionFailedException(Assertions.scala:1231)
at org.scalatest.Assertions$AssertionsHelper.macroAssert(Assertions.scala:1295)
at org.apache.spark.sql.ConfigBehaviorSuite.$anonfun$new$7(ConfigBehaviorSuite.scala:92)
at scala.runtime.java8.JFunction0$mcV$sp.apply(JFunction0$mcV$sp.java:23)
at org.scalatest.enablers.Timed$$anon$1.timeoutAfter(Timed.scala:127)
at org.scalatest.concurrent.TimeLimits$.failAfterImpl(TimeLimits.scala:282)
at org.scalatest.concurrent.TimeLimits.failAfter(TimeLimits.scala:231)
at org.scalatest.concurrent.TimeLimits.failAfter$(TimeLimits.scala:230)
at org.apache.spark.SparkFunSuite.failAfter(SparkFunSuite.scala:69)
at org.apache.spark.SparkFunSuite.$anonfun$test$2(SparkFunSuite.scala:155)
at org.scalatest.OutcomeOf.outcomeOf(OutcomeOf.scala:85)
at org.scalatest.OutcomeOf.outcomeOf$(OutcomeOf.scala:83)
at org.scalatest.OutcomeOf$.outcomeOf(OutcomeOf.scala:104)
at org.scalatest.Transformer.apply(Transformer.scala:22)
at org.scalatest.Transformer.apply(Transformer.scala:20)
at org.scalatest.funsuite.AnyFunSuiteLike$$anon$1.apply(AnyFunSuiteLike.scala:226)
at org.apache.spark.SparkFunSuite.withFixture(SparkFunSuite.scala:227)
at org.scalatest.funsuite.AnyFunSuiteLike.invokeWithFixture$1(AnyFunSuiteLike.scala:224)
at org.scalatest.funsuite.AnyFunSuiteLike.$anonfun$runTest$1(AnyFunSuiteLike.scala:236)
at org.scalatest.SuperEngine.runTestImpl(Engine.scala:306)
at org.scalatest.funsuite.AnyFunSuiteLike.runTest(AnyFunSuiteLike.scala:236)
at org.scalatest.funsuite.AnyFunSuiteLike.runTest$(AnyFunSuiteLike.scala:218)
at org.apache.spark.SparkFunSuite.org$scalatest$BeforeAndAfterEach$$super$runTest(SparkFunSuite.scala:69)
at org.scalatest.BeforeAndAfterEach.runTest(BeforeAndAfterEach.scala:234)
at org.scalatest.BeforeAndAfterEach.runTest$(BeforeAndAfterEach.scala:227)
at org.apache.spark.SparkFunSuite.runTest(SparkFunSuite.scala:69)
at org.scalatest.funsuite.AnyFunSuiteLike.$anonfun$runTests$1(AnyFunSuiteLike.scala:269)
at org.scalatest.SuperEngine.$anonfun$runTestsInBranch$1(Engine.scala:413)
at scala.collection.immutable.List.foreach(List.scala:431)
at org.scalatest.SuperEngine.traverseSubNodes$1(Engine.scala:401)
at org.scalatest.SuperEngine.runTestsInBranch(Engine.scala:396)
at org.scalatest.SuperEngine.runTestsImpl(Engine.scala:475)
at org.scalatest.funsuite.AnyFunSuiteLike.runTests(AnyFunSuiteLike.scala:269)
at org.scalatest.funsuite.AnyFunSuiteLike.runTests$(AnyFunSuiteLike.scala:268)
at org.scalatest.funsuite.AnyFunSuite.runTests(AnyFunSuite.scala:1564)
at org.scalatest.Suite.run(Suite.scala:1114)
at org.scalatest.Suite.run$(Suite.scala:1096)
at org.scalatest.funsuite.AnyFunSuite.org$scalatest$funsuite$AnyFunSuiteLike$$super$run(AnyFunSuite.scala:1564)
at org.scalatest.funsuite.AnyFunSuiteLike.$anonfun$run$1(AnyFunSuiteLike.scala:273)
at org.scalatest.SuperEngine.runImpl(Engine.scala:535)
at org.scalatest.funsuite.AnyFunSuiteLike.run(AnyFunSuiteLike.scala:273)
at org.scalatest.funsuite.AnyFunSuiteLike.run$(AnyFunSuiteLike.scala:272)
at org.apache.spark.SparkFunSuite.org$scalatest$BeforeAndAfterAll$$super$run(SparkFunSuite.scala:69)
at org.scalatest.BeforeAndAfterAll.liftedTree1$1(BeforeAndAfterAll.scala:213)
at org.scalatest.BeforeAndAfterAll.run(BeforeAndAfterAll.scala:210)
at org.scalatest.BeforeAndAfterAll.run$(BeforeAndAfterAll.scala:208)
at org.apache.spark.SparkFunSuite.run(SparkFunSuite.scala:69)
at org.scalatest.Suite.callExecuteOnSuite$1(Suite.scala:1178)
at org.scalatest.Suite.$anonfun$runNestedSuites$1(Suite.scala:1225)
at scala.collection.IndexedSeqOptimized.foreach(IndexedSeqOptimized.scala:36)
at scala.collection.IndexedSeqOptimized.foreach$(IndexedSeqOptimized.scala:33)
at scala.collection.mutable.ArrayOps$ofRef.foreach(ArrayOps.scala:198)
at org.scalatest.Suite.runNestedSuites(Suite.scala:1223)
at org.scalatest.Suite.runNestedSuites$(Suite.scala:1156)
at org.scalatest.tools.DiscoverySuite.runNestedSuites(DiscoverySuite.scala:30)
at org.scalatest.Suite.run(Suite.scala:1111)
at org.scalatest.Suite.run$(Suite.scala:1096)
at org.scalatest.tools.DiscoverySuite.run(DiscoverySuite.scala:30)
at org.scalatest.tools.SuiteRunner.run(SuiteRunner.scala:47)
at org.scalatest.tools.Runner$.$anonfun$doRunRunRunDaDoRunRun$13(Runner.scala:1321)
at org.scalatest.tools.Runner$.$anonfun$doRunRunRunDaDoRunRun$13$adapted(Runner.scala:1315)
at scala.collection.immutable.List.foreach(List.scala:431)
at org.scalatest.tools.Runner$.doRunRunRunDaDoRunRun(Runner.scala:1315)
at org.scalatest.tools.Runner$.$anonfun$runOptionallyWithPassFailReporter$24(Runner.scala:992)
at org.scalatest.tools.Runner$.$anonfun$runOptionallyWithPassFailReporter$24$adapted(Runner.scala:970)
at org.scalatest.tools.Runner$.withClassLoaderAndDispatchReporter(Runner.scala:1481)
at org.scalatest.tools.Runner$.runOptionallyWithPassFailReporter(Runner.scala:970)
at org.scalatest.tools.Runner$.main(Runner.scala:775)
at org.scalatest.tools.Runner.main(Runner.scala)
Check failure on line 1 in org/apache/spark/sql/execution/adaptive/velox/VeloxAdaptiveQueryExecSuite
github-actions / Report test results
VeloxAdaptiveQueryExecSuite.SPARK-29906: AQE should not introduce extra shuffle for outermost limit
2 did not equal 1
Raw output
org.scalatest.exceptions.TestFailedException: 2 did not equal 1
at org.scalatest.Assertions.newAssertionFailedException(Assertions.scala:472)
at org.scalatest.Assertions.newAssertionFailedException$(Assertions.scala:471)
at org.scalatest.Assertions$.newAssertionFailedException(Assertions.scala:1231)
at org.scalatest.Assertions$AssertionsHelper.macroAssert(Assertions.scala:1295)
at org.apache.spark.sql.execution.adaptive.AdaptiveQueryExecSuite.$anonfun$new$62(AdaptiveQueryExecSuite.scala:770)
at org.apache.spark.sql.catalyst.plans.SQLHelper.withSQLConf(SQLHelper.scala:54)
at org.apache.spark.sql.catalyst.plans.SQLHelper.withSQLConf$(SQLHelper.scala:38)
at org.apache.spark.sql.execution.adaptive.AdaptiveQueryExecSuite.org$apache$spark$sql$test$SQLTestUtilsBase$$super$withSQLConf(AdaptiveQueryExecSuite.scala:54)
at org.apache.spark.sql.test.SQLTestUtilsBase.withSQLConf(SQLTestUtils.scala:247)
at org.apache.spark.sql.test.SQLTestUtilsBase.withSQLConf$(SQLTestUtils.scala:245)
at org.apache.spark.sql.execution.adaptive.AdaptiveQueryExecSuite.withSQLConf(AdaptiveQueryExecSuite.scala:54)
at org.apache.spark.sql.execution.adaptive.AdaptiveQueryExecSuite.$anonfun$new$61(AdaptiveQueryExecSuite.scala:765)
at org.scalatest.enablers.Timed$$anon$1.timeoutAfter(Timed.scala:127)
at org.scalatest.concurrent.TimeLimits$.failAfterImpl(TimeLimits.scala:282)
at org.scalatest.concurrent.TimeLimits.failAfter(TimeLimits.scala:231)
at org.scalatest.concurrent.TimeLimits.failAfter$(TimeLimits.scala:230)
at org.apache.spark.SparkFunSuite.failAfter(SparkFunSuite.scala:69)
at org.apache.spark.SparkFunSuite.$anonfun$test$2(SparkFunSuite.scala:155)
at org.scalatest.OutcomeOf.outcomeOf(OutcomeOf.scala:85)
at org.scalatest.OutcomeOf.outcomeOf$(OutcomeOf.scala:83)
at org.scalatest.OutcomeOf$.outcomeOf(OutcomeOf.scala:104)
at org.scalatest.Transformer.apply(Transformer.scala:22)
at org.scalatest.Transformer.apply(Transformer.scala:20)
at org.scalatest.funsuite.AnyFunSuiteLike$$anon$1.apply(AnyFunSuiteLike.scala:226)
at org.apache.spark.SparkFunSuite.withFixture(SparkFunSuite.scala:227)
at org.scalatest.funsuite.AnyFunSuiteLike.invokeWithFixture$1(AnyFunSuiteLike.scala:224)
at org.scalatest.funsuite.AnyFunSuiteLike.$anonfun$runTest$1(AnyFunSuiteLike.scala:236)
at org.scalatest.SuperEngine.runTestImpl(Engine.scala:306)
at org.scalatest.funsuite.AnyFunSuiteLike.runTest(AnyFunSuiteLike.scala:236)
at org.scalatest.funsuite.AnyFunSuiteLike.runTest$(AnyFunSuiteLike.scala:218)
at org.apache.spark.SparkFunSuite.org$scalatest$BeforeAndAfterEach$$super$runTest(SparkFunSuite.scala:69)
at org.scalatest.BeforeAndAfterEach.runTest(BeforeAndAfterEach.scala:234)
at org.scalatest.BeforeAndAfterEach.runTest$(BeforeAndAfterEach.scala:227)
at org.apache.spark.SparkFunSuite.runTest(SparkFunSuite.scala:69)
at org.scalatest.funsuite.AnyFunSuiteLike.$anonfun$runTests$1(AnyFunSuiteLike.scala:269)
at org.scalatest.SuperEngine.$anonfun$runTestsInBranch$1(Engine.scala:413)
at scala.collection.immutable.List.foreach(List.scala:431)
at org.scalatest.SuperEngine.traverseSubNodes$1(Engine.scala:401)
at org.scalatest.SuperEngine.runTestsInBranch(Engine.scala:396)
at org.scalatest.SuperEngine.runTestsImpl(Engine.scala:475)
at org.scalatest.funsuite.AnyFunSuiteLike.runTests(AnyFunSuiteLike.scala:269)
at org.scalatest.funsuite.AnyFunSuiteLike.runTests$(AnyFunSuiteLike.scala:268)
at org.scalatest.funsuite.AnyFunSuite.runTests(AnyFunSuite.scala:1564)
at org.scalatest.Suite.run(Suite.scala:1114)
at org.scalatest.Suite.run$(Suite.scala:1096)
at org.scalatest.funsuite.AnyFunSuite.org$scalatest$funsuite$AnyFunSuiteLike$$super$run(AnyFunSuite.scala:1564)
at org.scalatest.funsuite.AnyFunSuiteLike.$anonfun$run$1(AnyFunSuiteLike.scala:273)
at org.scalatest.SuperEngine.runImpl(Engine.scala:535)
at org.scalatest.funsuite.AnyFunSuiteLike.run(AnyFunSuiteLike.scala:273)
at org.scalatest.funsuite.AnyFunSuiteLike.run$(AnyFunSuiteLike.scala:272)
at org.apache.spark.SparkFunSuite.org$scalatest$BeforeAndAfterAll$$super$run(SparkFunSuite.scala:69)
at org.scalatest.BeforeAndAfterAll.liftedTree1$1(BeforeAndAfterAll.scala:213)
at org.scalatest.BeforeAndAfterAll.run(BeforeAndAfterAll.scala:210)
at org.scalatest.BeforeAndAfterAll.run$(BeforeAndAfterAll.scala:208)
at org.apache.spark.SparkFunSuite.run(SparkFunSuite.scala:69)
at org.scalatest.Suite.callExecuteOnSuite$1(Suite.scala:1178)
at org.scalatest.Suite.$anonfun$runNestedSuites$1(Suite.scala:1225)
at scala.collection.IndexedSeqOptimized.foreach(IndexedSeqOptimized.scala:36)
at scala.collection.IndexedSeqOptimized.foreach$(IndexedSeqOptimized.scala:33)
at scala.collection.mutable.ArrayOps$ofRef.foreach(ArrayOps.scala:198)
at org.scalatest.Suite.runNestedSuites(Suite.scala:1223)
at org.scalatest.Suite.runNestedSuites$(Suite.scala:1156)
at org.scalatest.tools.DiscoverySuite.runNestedSuites(DiscoverySuite.scala:30)
at org.scalatest.Suite.run(Suite.scala:1111)
at org.scalatest.Suite.run$(Suite.scala:1096)
at org.scalatest.tools.DiscoverySuite.run(DiscoverySuite.scala:30)
at org.scalatest.tools.SuiteRunner.run(SuiteRunner.scala:47)
at org.scalatest.tools.Runner$.$anonfun$doRunRunRunDaDoRunRun$13(Runner.scala:1321)
at org.scalatest.tools.Runner$.$anonfun$doRunRunRunDaDoRunRun$13$adapted(Runner.scala:1315)
at scala.collection.immutable.List.foreach(List.scala:431)
at org.scalatest.tools.Runner$.doRunRunRunDaDoRunRun(Runner.scala:1315)
at org.scalatest.tools.Runner$.$anonfun$runOptionallyWithPassFailReporter$24(Runner.scala:992)
at org.scalatest.tools.Runner$.$anonfun$runOptionallyWithPassFailReporter$24$adapted(Runner.scala:970)
at org.scalatest.tools.Runner$.withClassLoaderAndDispatchReporter(Runner.scala:1481)
at org.scalatest.tools.Runner$.runOptionallyWithPassFailReporter(Runner.scala:970)
at org.scalatest.tools.Runner$.main(Runner.scala:775)
at org.scalatest.tools.Runner.main(Runner.scala)
Check failure on line 1 in org/apache/spark/sql/GlutenConfigBehaviorSuite
github-actions / Report test results
GlutenConfigBehaviorSuite.SPARK-40211: customize initialNumPartitions for take
1 was not greater than 1
Raw output
org.scalatest.exceptions.TestFailedException: 1 was not greater than 1
at org.scalatest.Assertions.newAssertionFailedException(Assertions.scala:472)
at org.scalatest.Assertions.newAssertionFailedException$(Assertions.scala:471)
at org.scalatest.Assertions$.newAssertionFailedException(Assertions.scala:1231)
at org.scalatest.Assertions$AssertionsHelper.macroAssert(Assertions.scala:1295)
at org.apache.spark.sql.ConfigBehaviorSuite.$anonfun$new$7(ConfigBehaviorSuite.scala:92)
at scala.runtime.java8.JFunction0$mcV$sp.apply(JFunction0$mcV$sp.scala:18)
at org.scalatest.enablers.Timed$$anon$1.timeoutAfter(Timed.scala:127)
at org.scalatest.concurrent.TimeLimits$.failAfterImpl(TimeLimits.scala:282)
at org.scalatest.concurrent.TimeLimits.failAfter(TimeLimits.scala:231)
at org.scalatest.concurrent.TimeLimits.failAfter$(TimeLimits.scala:230)
at org.apache.spark.SparkFunSuite.failAfter(SparkFunSuite.scala:69)
at org.apache.spark.SparkFunSuite.$anonfun$test$2(SparkFunSuite.scala:155)
at org.scalatest.OutcomeOf.outcomeOf(OutcomeOf.scala:85)
at org.scalatest.OutcomeOf.outcomeOf$(OutcomeOf.scala:83)
at org.scalatest.OutcomeOf$.outcomeOf(OutcomeOf.scala:104)
at org.scalatest.Transformer.apply(Transformer.scala:22)
at org.scalatest.Transformer.apply(Transformer.scala:20)
at org.scalatest.funsuite.AnyFunSuiteLike$$anon$1.apply(AnyFunSuiteLike.scala:226)
at org.apache.spark.SparkFunSuite.withFixture(SparkFunSuite.scala:227)
at org.scalatest.funsuite.AnyFunSuiteLike.invokeWithFixture$1(AnyFunSuiteLike.scala:224)
at org.scalatest.funsuite.AnyFunSuiteLike.$anonfun$runTest$1(AnyFunSuiteLike.scala:236)
at org.scalatest.SuperEngine.runTestImpl(Engine.scala:306)
at org.scalatest.funsuite.AnyFunSuiteLike.runTest(AnyFunSuiteLike.scala:236)
at org.scalatest.funsuite.AnyFunSuiteLike.runTest$(AnyFunSuiteLike.scala:218)
at org.apache.spark.SparkFunSuite.org$scalatest$BeforeAndAfterEach$$super$runTest(SparkFunSuite.scala:69)
at org.scalatest.BeforeAndAfterEach.runTest(BeforeAndAfterEach.scala:234)
at org.scalatest.BeforeAndAfterEach.runTest$(BeforeAndAfterEach.scala:227)
at org.apache.spark.SparkFunSuite.runTest(SparkFunSuite.scala:69)
at org.scalatest.funsuite.AnyFunSuiteLike.$anonfun$runTests$1(AnyFunSuiteLike.scala:269)
at org.scalatest.SuperEngine.$anonfun$runTestsInBranch$1(Engine.scala:413)
at scala.collection.immutable.List.foreach(List.scala:333)
at org.scalatest.SuperEngine.traverseSubNodes$1(Engine.scala:401)
at org.scalatest.SuperEngine.runTestsInBranch(Engine.scala:396)
at org.scalatest.SuperEngine.runTestsImpl(Engine.scala:475)
at org.scalatest.funsuite.AnyFunSuiteLike.runTests(AnyFunSuiteLike.scala:269)
at org.scalatest.funsuite.AnyFunSuiteLike.runTests$(AnyFunSuiteLike.scala:268)
at org.scalatest.funsuite.AnyFunSuite.runTests(AnyFunSuite.scala:1564)
at org.scalatest.Suite.run(Suite.scala:1114)
at org.scalatest.Suite.run$(Suite.scala:1096)
at org.scalatest.funsuite.AnyFunSuite.org$scalatest$funsuite$AnyFunSuiteLike$$super$run(AnyFunSuite.scala:1564)
at org.scalatest.funsuite.AnyFunSuiteLike.$anonfun$run$1(AnyFunSuiteLike.scala:273)
at org.scalatest.SuperEngine.runImpl(Engine.scala:535)
at org.scalatest.funsuite.AnyFunSuiteLike.run(AnyFunSuiteLike.scala:273)
at org.scalatest.funsuite.AnyFunSuiteLike.run$(AnyFunSuiteLike.scala:272)
at org.apache.spark.SparkFunSuite.org$scalatest$BeforeAndAfterAll$$super$run(SparkFunSuite.scala:69)
at org.scalatest.BeforeAndAfterAll.liftedTree1$1(BeforeAndAfterAll.scala:213)
at org.scalatest.BeforeAndAfterAll.run(BeforeAndAfterAll.scala:210)
at org.scalatest.BeforeAndAfterAll.run$(BeforeAndAfterAll.scala:208)
at org.apache.spark.SparkFunSuite.run(SparkFunSuite.scala:69)
at org.scalatest.Suite.callExecuteOnSuite$1(Suite.scala:1178)
at org.scalatest.Suite.$anonfun$runNestedSuites$1(Suite.scala:1225)
at scala.collection.ArrayOps$.foreach$extension(ArrayOps.scala:1328)
at org.scalatest.Suite.runNestedSuites(Suite.scala:1223)
at org.scalatest.Suite.runNestedSuites$(Suite.scala:1156)
at org.scalatest.tools.DiscoverySuite.runNestedSuites(DiscoverySuite.scala:30)
at org.scalatest.Suite.run(Suite.scala:1111)
at org.scalatest.Suite.run$(Suite.scala:1096)
at org.scalatest.tools.DiscoverySuite.run(DiscoverySuite.scala:30)
at org.scalatest.tools.SuiteRunner.run(SuiteRunner.scala:47)
at org.scalatest.tools.Runner$.$anonfun$doRunRunRunDaDoRunRun$13(Runner.scala:1321)
at org.scalatest.tools.Runner$.$anonfun$doRunRunRunDaDoRunRun$13$adapted(Runner.scala:1315)
at scala.collection.immutable.List.foreach(List.scala:333)
at org.scalatest.tools.Runner$.doRunRunRunDaDoRunRun(Runner.scala:1315)
at org.scalatest.tools.Runner$.$anonfun$runOptionallyWithPassFailReporter$24(Runner.scala:992)
at org.scalatest.tools.Runner$.$anonfun$runOptionallyWithPassFailReporter$24$adapted(Runner.scala:970)
at org.scalatest.tools.Runner$.withClassLoaderAndDispatchReporter(Runner.scala:1481)
at org.scalatest.tools.Runner$.runOptionallyWithPassFailReporter(Runner.scala:970)
at org.scalatest.tools.Runner$.main(Runner.scala:775)
at org.scalatest.tools.Runner.main(Runner.scala)
Check failure on line 1 in org/apache/spark/sql/execution/adaptive/velox/VeloxAdaptiveQueryExecSuite
github-actions / Report test results
VeloxAdaptiveQueryExecSuite.SPARK-29906: AQE should not introduce extra shuffle for outermost limit
2 did not equal 1
Raw output
org.scalatest.exceptions.TestFailedException: 2 did not equal 1
at org.scalatest.Assertions.newAssertionFailedException(Assertions.scala:472)
at org.scalatest.Assertions.newAssertionFailedException$(Assertions.scala:471)
at org.scalatest.Assertions$.newAssertionFailedException(Assertions.scala:1231)
at org.scalatest.Assertions$AssertionsHelper.macroAssert(Assertions.scala:1295)
at org.apache.spark.sql.execution.adaptive.AdaptiveQueryExecSuite.$anonfun$new$62(AdaptiveQueryExecSuite.scala:770)
at org.apache.spark.sql.catalyst.plans.SQLHelper.withSQLConf(SQLHelper.scala:54)
at org.apache.spark.sql.catalyst.plans.SQLHelper.withSQLConf$(SQLHelper.scala:38)
at org.apache.spark.sql.execution.adaptive.AdaptiveQueryExecSuite.org$apache$spark$sql$test$SQLTestUtilsBase$$super$withSQLConf(AdaptiveQueryExecSuite.scala:54)
at org.apache.spark.sql.test.SQLTestUtilsBase.withSQLConf(SQLTestUtils.scala:247)
at org.apache.spark.sql.test.SQLTestUtilsBase.withSQLConf$(SQLTestUtils.scala:245)
at org.apache.spark.sql.execution.adaptive.AdaptiveQueryExecSuite.withSQLConf(AdaptiveQueryExecSuite.scala:54)
at org.apache.spark.sql.execution.adaptive.AdaptiveQueryExecSuite.$anonfun$new$61(AdaptiveQueryExecSuite.scala:765)
at org.scalatest.enablers.Timed$$anon$1.timeoutAfter(Timed.scala:127)
at org.scalatest.concurrent.TimeLimits$.failAfterImpl(TimeLimits.scala:282)
at org.scalatest.concurrent.TimeLimits.failAfter(TimeLimits.scala:231)
at org.scalatest.concurrent.TimeLimits.failAfter$(TimeLimits.scala:230)
at org.apache.spark.SparkFunSuite.failAfter(SparkFunSuite.scala:69)
at org.apache.spark.SparkFunSuite.$anonfun$test$2(SparkFunSuite.scala:155)
at org.scalatest.OutcomeOf.outcomeOf(OutcomeOf.scala:85)
at org.scalatest.OutcomeOf.outcomeOf$(OutcomeOf.scala:83)
at org.scalatest.OutcomeOf$.outcomeOf(OutcomeOf.scala:104)
at org.scalatest.Transformer.apply(Transformer.scala:22)
at org.scalatest.Transformer.apply(Transformer.scala:20)
at org.scalatest.funsuite.AnyFunSuiteLike$$anon$1.apply(AnyFunSuiteLike.scala:226)
at org.apache.spark.SparkFunSuite.withFixture(SparkFunSuite.scala:227)
at org.scalatest.funsuite.AnyFunSuiteLike.invokeWithFixture$1(AnyFunSuiteLike.scala:224)
at org.scalatest.funsuite.AnyFunSuiteLike.$anonfun$runTest$1(AnyFunSuiteLike.scala:236)
at org.scalatest.SuperEngine.runTestImpl(Engine.scala:306)
at org.scalatest.funsuite.AnyFunSuiteLike.runTest(AnyFunSuiteLike.scala:236)
at org.scalatest.funsuite.AnyFunSuiteLike.runTest$(AnyFunSuiteLike.scala:218)
at org.apache.spark.SparkFunSuite.org$scalatest$BeforeAndAfterEach$$super$runTest(SparkFunSuite.scala:69)
at org.scalatest.BeforeAndAfterEach.runTest(BeforeAndAfterEach.scala:234)
at org.scalatest.BeforeAndAfterEach.runTest$(BeforeAndAfterEach.scala:227)
at org.apache.spark.SparkFunSuite.runTest(SparkFunSuite.scala:69)
at org.scalatest.funsuite.AnyFunSuiteLike.$anonfun$runTests$1(AnyFunSuiteLike.scala:269)
at org.scalatest.SuperEngine.$anonfun$runTestsInBranch$1(Engine.scala:413)
at scala.collection.immutable.List.foreach(List.scala:333)
at org.scalatest.SuperEngine.traverseSubNodes$1(Engine.scala:401)
at org.scalatest.SuperEngine.runTestsInBranch(Engine.scala:396)
at org.scalatest.SuperEngine.runTestsImpl(Engine.scala:475)
at org.scalatest.funsuite.AnyFunSuiteLike.runTests(AnyFunSuiteLike.scala:269)
at org.scalatest.funsuite.AnyFunSuiteLike.runTests$(AnyFunSuiteLike.scala:268)
at org.scalatest.funsuite.AnyFunSuite.runTests(AnyFunSuite.scala:1564)
at org.scalatest.Suite.run(Suite.scala:1114)
at org.scalatest.Suite.run$(Suite.scala:1096)
at org.scalatest.funsuite.AnyFunSuite.org$scalatest$funsuite$AnyFunSuiteLike$$super$run(AnyFunSuite.scala:1564)
at org.scalatest.funsuite.AnyFunSuiteLike.$anonfun$run$1(AnyFunSuiteLike.scala:273)
at org.scalatest.SuperEngine.runImpl(Engine.scala:535)
at org.scalatest.funsuite.AnyFunSuiteLike.run(AnyFunSuiteLike.scala:273)
at org.scalatest.funsuite.AnyFunSuiteLike.run$(AnyFunSuiteLike.scala:272)
at org.apache.spark.SparkFunSuite.org$scalatest$BeforeAndAfterAll$$super$run(SparkFunSuite.scala:69)
at org.scalatest.BeforeAndAfterAll.liftedTree1$1(BeforeAndAfterAll.scala:213)
at org.scalatest.BeforeAndAfterAll.run(BeforeAndAfterAll.scala:210)
at org.scalatest.BeforeAndAfterAll.run$(BeforeAndAfterAll.scala:208)
at org.apache.spark.SparkFunSuite.run(SparkFunSuite.scala:69)
at org.scalatest.Suite.callExecuteOnSuite$1(Suite.scala:1178)
at org.scalatest.Suite.$anonfun$runNestedSuites$1(Suite.scala:1225)
at scala.collection.ArrayOps$.foreach$extension(ArrayOps.scala:1328)
at org.scalatest.Suite.runNestedSuites(Suite.scala:1223)
at org.scalatest.Suite.runNestedSuites$(Suite.scala:1156)
at org.scalatest.tools.DiscoverySuite.runNestedSuites(DiscoverySuite.scala:30)
at org.scalatest.Suite.run(Suite.scala:1111)
at org.scalatest.Suite.run$(Suite.scala:1096)
at org.scalatest.tools.DiscoverySuite.run(DiscoverySuite.scala:30)
at org.scalatest.tools.SuiteRunner.run(SuiteRunner.scala:47)
at org.scalatest.tools.Runner$.$anonfun$doRunRunRunDaDoRunRun$13(Runner.scala:1321)
at org.scalatest.tools.Runner$.$anonfun$doRunRunRunDaDoRunRun$13$adapted(Runner.scala:1315)
at scala.collection.immutable.List.foreach(List.scala:333)
at org.scalatest.tools.Runner$.doRunRunRunDaDoRunRun(Runner.scala:1315)
at org.scalatest.tools.Runner$.$anonfun$runOptionallyWithPassFailReporter$24(Runner.scala:992)
at org.scalatest.tools.Runner$.$anonfun$runOptionallyWithPassFailReporter$24$adapted(Runner.scala:970)
at org.scalatest.tools.Runner$.withClassLoaderAndDispatchReporter(Runner.scala:1481)
at org.scalatest.tools.Runner$.runOptionallyWithPassFailReporter(Runner.scala:970)
at org.scalatest.tools.Runner$.main(Runner.scala:775)
at org.scalatest.tools.Runner.main(Runner.scala)
Check failure on line 493 in org/apache/spark/sql/GlutenSQLQueryTestSuite
github-actions / Report test results
GlutenSQLQueryTestSuite.subquery/in-subquery/in-limit.sql
subquery/in-subquery/in-limit.sql
Expected "[val1e 10 NULL 19 17.0 25.0 2600 2014-05-04 01:01:00 2014-05-04
val1e 10 NULL 19 17.0 25.0 2600 2014-09-04 01:02:00.001 2014-09-04]", but got "[]" Result did not match for query #13
SELECT *
FROM t1
WHERE t1a IN (SELECT t2a
FROM t2
WHERE t1d = t2d)
OFFSET 2
Raw output
org.scalatest.exceptions.TestFailedException: subquery/in-subquery/in-limit.sql
Expected "[val1e 10 NULL 19 17.0 25.0 2600 2014-05-04 01:01:00 2014-05-04
val1e 10 NULL 19 17.0 25.0 2600 2014-09-04 01:02:00.001 2014-09-04]", but got "[]" Result did not match for query #13
SELECT *
FROM t1
WHERE t1a IN (SELECT t2a
FROM t2
WHERE t1d = t2d)
OFFSET 2
at org.scalatest.Assertions.newAssertionFailedException(Assertions.scala:472)
at org.scalatest.Assertions.newAssertionFailedException$(Assertions.scala:471)
at org.scalatest.funsuite.AnyFunSuite.newAssertionFailedException(AnyFunSuite.scala:1564)
at org.scalatest.Assertions.assertResult(Assertions.scala:847)
at org.scalatest.Assertions.assertResult$(Assertions.scala:842)
at org.scalatest.funsuite.AnyFunSuite.assertResult(AnyFunSuite.scala:1564)
at org.apache.spark.sql.GlutenSQLQueryTestSuite.$anonfun$readGoldenFileAndCompareResults$3(GlutenSQLQueryTestSuite.scala:987)
at scala.collection.mutable.ResizableArray.foreach(ResizableArray.scala:62)
at scala.collection.mutable.ResizableArray.foreach$(ResizableArray.scala:55)
at scala.collection.mutable.ArrayBuffer.foreach(ArrayBuffer.scala:49)
at org.apache.spark.sql.GlutenSQLQueryTestSuite.readGoldenFileAndCompareResults(GlutenSQLQueryTestSuite.scala:974)
at org.apache.spark.sql.GlutenSQLQueryTestSuite.$anonfun$runQueries$10(GlutenSQLQueryTestSuite.scala:776)
at scala.runtime.java8.JFunction0$mcV$sp.apply(JFunction0$mcV$sp.java:23)
at org.scalatest.Assertions.withClue(Assertions.scala:1065)
at org.scalatest.Assertions.withClue$(Assertions.scala:1052)
at org.scalatest.funsuite.AnyFunSuite.withClue(AnyFunSuite.scala:1564)
at org.apache.spark.sql.GlutenSQLQueryTestSuite.runQueries(GlutenSQLQueryTestSuite.scala:772)
at org.apache.spark.sql.GlutenSQLQueryTestSuite.$anonfun$runSqlTestCase$34(GlutenSQLQueryTestSuite.scala:606)
at org.apache.spark.sql.GlutenSQLQueryTestSuite.$anonfun$runSqlTestCase$34$adapted(GlutenSQLQueryTestSuite.scala:604)
at scala.collection.mutable.ResizableArray.foreach(ResizableArray.scala:62)
at scala.collection.mutable.ResizableArray.foreach$(ResizableArray.scala:55)
at scala.collection.mutable.ArrayBuffer.foreach(ArrayBuffer.scala:49)
at org.apache.spark.sql.GlutenSQLQueryTestSuite.runSqlTestCase(GlutenSQLQueryTestSuite.scala:604)
at org.apache.spark.sql.GlutenSQLQueryTestSuite.$anonfun$createScalaTestCase$7(GlutenSQLQueryTestSuite.scala:493)
at scala.runtime.java8.JFunction0$mcV$sp.apply(JFunction0$mcV$sp.java:23)
at org.scalatest.enablers.Timed$$anon$1.timeoutAfter(Timed.scala:127)
at org.scalatest.concurrent.TimeLimits$.failAfterImpl(TimeLimits.scala:282)
at org.scalatest.concurrent.TimeLimits.failAfter(TimeLimits.scala:231)
at org.scalatest.concurrent.TimeLimits.failAfter$(TimeLimits.scala:230)
at org.apache.spark.SparkFunSuite.failAfter(SparkFunSuite.scala:69)
at org.apache.spark.SparkFunSuite.$anonfun$test$2(SparkFunSuite.scala:155)
at org.scalatest.OutcomeOf.outcomeOf(OutcomeOf.scala:85)
at org.scalatest.OutcomeOf.outcomeOf$(OutcomeOf.scala:83)
at org.scalatest.OutcomeOf$.outcomeOf(OutcomeOf.scala:104)
at org.scalatest.Transformer.apply(Transformer.scala:22)
at org.scalatest.Transformer.apply(Transformer.scala:20)
at org.scalatest.funsuite.AnyFunSuiteLike$$anon$1.apply(AnyFunSuiteLike.scala:226)
at org.apache.spark.SparkFunSuite.withFixture(SparkFunSuite.scala:227)
at org.scalatest.funsuite.AnyFunSuiteLike.invokeWithFixture$1(AnyFunSuiteLike.scala:224)
at org.scalatest.funsuite.AnyFunSuiteLike.$anonfun$runTest$1(AnyFunSuiteLike.scala:236)
at org.scalatest.SuperEngine.runTestImpl(Engine.scala:306)
at org.scalatest.funsuite.AnyFunSuiteLike.runTest(AnyFunSuiteLike.scala:236)
at org.scalatest.funsuite.AnyFunSuiteLike.runTest$(AnyFunSuiteLike.scala:218)
at org.apache.spark.SparkFunSuite.org$scalatest$BeforeAndAfterEach$$super$runTest(SparkFunSuite.scala:69)
at org.scalatest.BeforeAndAfterEach.runTest(BeforeAndAfterEach.scala:234)
at org.scalatest.BeforeAndAfterEach.runTest$(BeforeAndAfterEach.scala:227)
at org.apache.spark.SparkFunSuite.runTest(SparkFunSuite.scala:69)
at org.scalatest.funsuite.AnyFunSuiteLike.$anonfun$runTests$1(AnyFunSuiteLike.scala:269)
at org.scalatest.SuperEngine.$anonfun$runTestsInBranch$1(Engine.scala:413)
at scala.collection.immutable.List.foreach(List.scala:431)
at org.scalatest.SuperEngine.traverseSubNodes$1(Engine.scala:401)
at org.scalatest.SuperEngine.runTestsInBranch(Engine.scala:396)
at org.scalatest.SuperEngine.runTestsImpl(Engine.scala:475)
at org.scalatest.funsuite.AnyFunSuiteLike.runTests(AnyFunSuiteLike.scala:269)
at org.scalatest.funsuite.AnyFunSuiteLike.runTests$(AnyFunSuiteLike.scala:268)
at org.scalatest.funsuite.AnyFunSuite.runTests(AnyFunSuite.scala:1564)
at org.scalatest.Suite.run(Suite.scala:1114)
at org.scalatest.Suite.run$(Suite.scala:1096)
at org.scalatest.funsuite.AnyFunSuite.org$scalatest$funsuite$AnyFunSuiteLike$$super$run(AnyFunSuite.scala:1564)
at org.scalatest.funsuite.AnyFunSuiteLike.$anonfun$run$1(AnyFunSuiteLike.scala:273)
at org.scalatest.SuperEngine.runImpl(Engine.scala:535)
at org.scalatest.funsuite.AnyFunSuiteLike.run(AnyFunSuiteLike.scala:273)
at org.scalatest.funsuite.AnyFunSuiteLike.run$(AnyFunSuiteLike.scala:272)
at org.apache.spark.SparkFunSuite.org$scalatest$BeforeAndAfterAll$$super$run(SparkFunSuite.scala:69)
at org.scalatest.BeforeAndAfterAll.liftedTree1$1(BeforeAndAfterAll.scala:213)
at org.scalatest.BeforeAndAfterAll.run(BeforeAndAfterAll.scala:210)
at org.scalatest.BeforeAndAfterAll.run$(BeforeAndAfterAll.scala:208)
at org.apache.spark.SparkFunSuite.run(SparkFunSuite.scala:69)
at org.scalatest.Suite.callExecuteOnSuite$1(Suite.scala:1178)
at org.scalatest.Suite.$anonfun$runNestedSuites$1(Suite.scala:1225)
at scala.collection.IndexedSeqOptimized.foreach(IndexedSeqOptimized.scala:36)
at scala.collection.IndexedSeqOptimized.foreach$(IndexedSeqOptimized.scala:33)
at scala.collection.mutable.ArrayOps$ofRef.foreach(ArrayOps.scala:198)
at org.scalatest.Suite.runNestedSuites(Suite.scala:1223)
at org.scalatest.Suite.runNestedSuites$(Suite.scala:1156)
at org.scalatest.tools.DiscoverySuite.runNestedSuites(DiscoverySuite.scala:30)
at org.scalatest.Suite.run(Suite.scala:1111)
at org.scalatest.Suite.run$(Suite.scala:1096)
at org.scalatest.tools.DiscoverySuite.run(DiscoverySuite.scala:30)
at org.scalatest.tools.SuiteRunner.run(SuiteRunner.scala:47)
at org.scalatest.tools.Runner$.$anonfun$doRunRunRunDaDoRunRun$13(Runner.scala:1321)
at org.scalatest.tools.Runner$.$anonfun$doRunRunRunDaDoRunRun$13$adapted(Runner.scala:1315)
at scala.collection.immutable.List.foreach(List.scala:431)
at org.scalatest.tools.Runner$.doRunRunRunDaDoRunRun(Runner.scala:1315)
at org.scalatest.tools.Runner$.$anonfun$runOptionallyWithPassFailReporter$24(Runner.scala:992)
at org.scalatest.tools.Runner$.$anonfun$runOptionallyWithPassFailReporter$24$adapted(Runner.scala:970)
at org.scalatest.tools.Runner$.withClassLoaderAndDispatchReporter(Runner.scala:1481)
at org.scalatest.tools.Runner$.runOptionallyWithPassFailReporter(Runner.scala:970)
at org.scalatest.tools.Runner$.main(Runner.scala:775)
at org.scalatest.tools.Runner.main(Runner.scala)